program: Gaussian 16
title: title
version: ES64L-G16RevC.01
frameworkgroup: C1[X(C42H50O31Zr6)]
method: RM06
basis: Gen
operation: Freq
keyword: #pfreq=noraman
keyword: M06/gen
keyword: integral=grid=ultrafine
keyword: pseudo=read
keyword: scf=(intrep,xqc,maxconventionalcycles=150)
title: #p freq=noraman M06/gen integral=grid=ultrafine pseudo=read scf=(intre
basis: NPDir=0 NMtPBC= 1 NCelOv= 1 NCel= 1 NClECP= 1 NCelD= 1
basis: NCelK= 1 NCelE2= 1 NClLst= 1 CellRange= 0.0.
basis: One-electron integrals computed using PRISM.
basis: One-electron integral symmetry used in STVInt
converged: YES YES NO YES
title: Mulliken charges:
elementType: Zr Zr Zr Zr Zr Zr C C C C C C C C C C C C C C C C C C C C C C C C C C C C C C C C C C C C C C C C C C H H H H H H H H H H H H H H H H H H H H H H H H H H H H H H H H H H H H H H H H H H H H H H H H H H O O O O O O O O O O O O O O O O O O O O O O O O O O O O O O O
charge: 1.165574 1.203602 1.152238 1.160229 1.292107 1.186139 -0.010979 -0.008589 -0.015923 -0.012482 0.431086 -0.037612 -0.008396 0.410606 -0.045005 -0.014386 -0.007560 0.001374 -0.010540 0.000460 -0.011256 0.001070 -0.010307 -0.000007 -0.016118 -0.014608 -0.008119 0.000433 0.424819 -0.038755 -0.008359 0.409841 -0.045614 -0.014584 -0.012328 -0.007007 -0.011809 -0.006156 0.424666 -0.037392 -0.009613 0.414030 -0.042272 -0.014986 -0.009018 0.000847 -0.016307 -0.013868 0.285721 0.244951 0.252267 0.255974 0.238946 0.267928 0.043272 0.042126 0.035930 0.043699 0.021939 0.021018 0.021823 0.021229 0.040403 0.021000 0.037952 0.037331 0.298587 0.245927 0.252331 0.256906 0.247304 0.249743 0.267547 0.042077 0.284271 0.244210 0.263001 0.250736 0.245100 0.248882 0.047266 0.039154 0.035729 0.021265 0.042344 0.275898 0.016282 0.016494 0.015584 0.016275 0.017037 0.015282 0.015630 0.016719 0.016294 0.017363 0.015509 0.016570 -0.405834 -0.422866 -0.298500 -0.811909 -0.423020 -0.271329 -0.588480 -0.411222 -0.528074 -0.541889 -0.405941 -0.420183 -0.297614 -0.812004 -0.410928 -0.278229 -0.576700 -0.400884 -0.473631 -0.541303 -0.417655 -0.534008 -0.514474 -0.437557 -0.807680 -0.417430 -0.278388 -0.581106 -0.394763 -0.826969 -0.615418
chargesum: -0.00000
polarizability: 1.01441813e+03 -1.15807914e+00 6.42578506e+02 -2.78878573e+00 2.13060354e+00 6.39245614e+02
temp: 298.150 k
press: 1.00000 atm
elementType: 40 40 40 40 40 40 6 6 6 6 6 6 6 6 6 6 6 6 6 6 6 6 6 6 6 6 6 6 6 6 6 6 6 6 6 6 6 6 6 6 6 6 6 6 6 6 6 6 1 1 1 1 1 1 1 1 1 1 1 1 1 1 1 1 1 1 1 1 1 1 1 1 1 1 1 1 1 1 1 1 1 1 1 1 1 1 1 1 1 1 1 1 1 1 1 1 1 1 8 8 8 8 8 8 8 8 8 8 8 8 8 8 8 8 8 8 8 8 8 8 8 8 8 8 8 8 8 8 8
symmnumber: 1
zpe: 2362364.4 jmol-1
zpe.correction: 0.899777 hartree
zpe.thermalcorrener: 0.979136 hartree
zpe.thermalcorrenthalpy: 0.980080 hartree
zpe.thermalcorrgfe: 0.794430 hartree
zpe.sumelectzpe: -4240.957576 hartree
zpe.sumelectthermal: -4240.878217 hartree
zpe.sumelectthermalent: -4240.877273 hartree
zpe.sumelectthermalfe: -4241.062923 hartree
dipole: -0.9081 -0.6317 -0.7227
dipole: 1.3214
quadrupole: -457.6756 -522.0461 -526.3240
quadrupole: -1.8831 -6.2802 -2.8941
quadrupole: 44.3396 -20.0309 -24.3088 -1.8831 -6.2802 -2.8941
hfenergy: -4241.8573526 hartree
pointgroup: C01 [X(C42H50O31Zr6)]
dipole: 0.3572691 -0.2485277 0.2843516 debye
polarizability: 1014.4181284|1.1580803|642.5785059|-2.7887857|-2.1306035|639.2456144 unknown
InChI: InChI=1/42C.31O.6Zr.50H
charge 0 multiplicity 1
129 atoms
Zr 1.475313 1.973766 0.507643
Zr -1.480171 -1.959132 -0.599771
Zr 1.475876 -1.458522 1.418871
Zr -1.499448 1.462392 -1.523352
Zr 1.477428 -0.509027 -1.940805
Zr -1.480139 0.529203 1.899628
C  -7.059411 -1.769988 3.658298
C  -5.757177 -1.456073 3.279863
C  7.120435 -4.05016 0.197501
C  5.814463 -3.583362 0.323694
C  3.826142 0.695169 2.258354
C  5.241804 0.851662 2.716059
C  6.01652 -0.280524 2.990634
C  -3.77141 -0.755789 -2.485459
C  -5.15589 -0.931973 -3.027725
C  -5.855856 0.163794 -3.544163
C  7.307037 3.048855 -1.712972
C  7.853342 2.593491 -2.91355
C  -7.172288 0.016343 -3.973451
C  -7.801451 -1.226903 -3.896209
C  -7.138501 -3.484383 1.963712
C  -7.758454 -2.781289 2.998061
C  -7.157062 3.356817 1.990178
C  -7.773219 3.966614 0.897042
C  7.078555 1.80977 -3.77091
C  5.766836 1.484627 -3.433231
C  7.337596 -0.142001 3.407311
C  7.893793 1.127973 3.565333
C  3.833986 -2.318694 -0.577792
C  5.238549 -2.819382 -0.697043
C  5.991155 -2.518166 -1.837625
C  -3.772452 2.460064 0.539493
C  -5.147793 3.030406 0.683214
C  -5.848646 2.893146 1.885712
C  -7.101548 -2.325386 -3.395333
C  -5.787341 -2.179097 -2.960798
C  -7.072929 4.117585 -0.299839
C  -5.767515 3.648372 -0.408729
C  3.803061 1.621473 -1.856205
C  5.211658 1.952784 -2.237378
C  5.992756 2.735529 -1.379102
C  -3.761403 -1.755216 1.78653
C  -5.134574 -2.152467 2.237144
C  -5.834306 -3.173714 1.585644
C  7.299845 -2.977409 -1.956931
C  7.867181 -3.750272 -0.943171
C  7.124022 2.259607 3.291282
C  5.806294 2.123342 2.862798
H  1.172048 -3.128015 -0.898203
H  -1.960675 1.828488 -4.069076
H  -0.157417 4.010413 -0.936707
H  -0.995589 4.016206 -2.296791
H  1.923343 -2.058087 -4.165684
H  0.701506 4.123001 1.964415
H  -5.201455 -0.65952 3.781441
H  5.217329 -3.809216 1.211695
H  5.566044 -1.268537 2.859343
H  -5.354091 1.134389 -3.586725
H  8.88428 2.844063 -3.179645
H  -8.837095 -1.340288 -4.229604
H  -8.784382 -3.023261 3.290066
H  -8.802664 4.327487 0.979461
H  5.151003 0.868927 -4.094946
H  8.930145 1.236296 3.898279
H  5.533461 -1.909213 -2.62214
H  -5.357148 2.400033 2.728892
H  1.100745 2.2638 -2.42009
H  -2.025405 2.553101 3.459023
H  -0.224636 -1.198252 3.880265
H  -0.904859 0.070979 4.543081
H  0.045665 2.930248 2.816593
H  2.097105 4.308907 -0.613936
H  0.665559 -3.806765 2.493523
H  -5.229744 -3.027438 -2.555518
H  1.123652 0.849721 3.102114
H  -2.005222 -4.360865 0.286553
H  -0.264703 -2.564341 -3.196447
H  -0.725619 -3.911116 -2.50927
H  0.055495 -3.946763 1.01786
H  2.009557 -1.716329 4.016639
H  -5.207297 3.745474 -1.342413
H  5.55164 3.083032 -0.440827
H  -5.344595 -3.708471 0.767269
H  8.89368 -4.115795 -1.039326
H  5.190884 3.000061 2.642362
H  -3.41202 -0.005662 -0.055168
H  -7.536434 -1.21714 4.472787
H  -7.6798 -4.278872 1.441845
H  -7.587574 -3.303687 -3.337899
H  -7.715327 0.880587 -4.366726
H  -7.551739 4.599706 -1.156999
H  -7.704128 3.236651 2.929717
H  7.883238 -2.729909 -2.848493
H  7.560996 -4.654786 0.995665
H  7.911019 3.652446 -1.029296
H  7.502161 1.448471 -4.712595
H  7.939436 -1.032814 3.609356
H  7.555824 3.257275 3.413588
O  3.305291 -0.445884 2.352853
O  3.239956 1.723402 1.812604
O  0.872302 3.255082 2.358415
O  -0.56989 1.674091 0.405113
O  -3.264868 -1.743626 -1.877226
O  -0.993778 -3.001118 -2.690336
O  0.80159 -2.260912 -0.694756
O  -3.216375 -2.417157 0.862821
O  -1.231932 -3.971581 -0.139732
O  1.361907 3.961149 -0.097618
O  3.313377 -1.799612 -1.599431
O  3.251642 -2.45254 0.536602
O  0.865851 -3.711936 1.550553
O  -0.581037 -1.241904 1.158382
O  -3.283121 2.432818 -0.621488
O  -1.023604 3.774227 -1.359317
O  0.780494 1.628718 -1.768683
O  -3.221135 0.367569 -2.608663
O  -1.442578 2.255052 -3.378328
O  1.284601 -1.9634 3.431881
O  -3.213043 1.99057 1.568524
O  -1.254851 1.975321 3.395679
O  1.261946 -1.607514 -3.632509
O  3.185819 0.758128 -2.555948
O  -0.588678 -0.432811 -1.747311
O  -3.258236 -0.732593 2.330633
O  -1.053054 -0.648625 3.913511
O  0.777751 0.588414 2.240968
O  3.316115 2.218866 -0.86664
O  1.886552 0.004843 0.002063
O  -2.449687 -0.001143 -0.063527
