program: Gaussian 16
title: title
version: ES64L-G16RevC.01
frameworkgroup: C1[X(C42H52O32Zr6)]
method: RM06
basis: Gen
operation: Freq
keyword: #pfreq=noraman
keyword: M06/gen
keyword: integral=grid=ultrafine
keyword: pseudo=read
keyword: scf=(intrep,xqc,maxconventionalcycles=150)
title: #p freq=noraman M06/gen integral=grid=ultrafine pseudo=read scf=(intre
basis: NPDir=0 NMtPBC= 1 NCelOv= 1 NCel= 1 NClECP= 1 NCelD= 1
basis: NCelK= 1 NCelE2= 1 NClLst= 1 CellRange= 0.0.
basis: One-electron integrals computed using PRISM.
basis: One-electron integral symmetry used in STVInt
converged: YES YES NO NO
title: Mulliken charges:
elementType: Zr Zr Zr Zr Zr Zr C C C C C C C C C C C C C C C C C C C C C C C C C C C C C C C C C C C C C C C C C C H H H H H H H H H H H H H H H H H H H H H H H H H H H H H H H H H H H H H H H H H H H H H H H H H H H H O O O O O O O O O O O O O O O O O O O O O O O O O O O O O O O O
charge: 1.163375 1.191136 1.162228 1.190792 1.162389 1.192279 -0.011727 -0.007414 -0.015081 -0.014397 0.429190 -0.036487 -0.010120 0.413851 -0.042761 -0.016292 -0.007931 0.000249 -0.009563 0.000331 -0.009920 0.000432 -0.009763 0.000381 -0.015426 -0.014373 -0.008282 0.000360 0.429562 -0.036841 -0.009924 0.413704 -0.042795 -0.015848 -0.011576 -0.007433 -0.011817 -0.007070 0.429393 -0.036578 -0.009570 0.414123 -0.043591 -0.014436 -0.008126 0.000202 -0.015361 -0.014172 0.283894 0.244837 0.254617 0.256340 0.245441 0.248114 0.267560 0.043322 0.042674 0.037641 0.038949 0.020573 0.021760 0.021784 0.021793 0.042693 0.020593 0.037519 0.038588 0.283787 0.244832 0.254573 0.256364 0.245463 0.248046 0.267593 0.043652 0.283917 0.244816 0.254613 0.256350 0.245539 0.248123 0.267628 0.042976 0.036978 0.037599 0.020564 0.042570 0.276258 0.016671 0.016365 0.016727 0.016287 0.016733 0.016287 0.015185 0.016054 0.015210 0.016120 0.015125 0.016060 -0.405539 -0.420412 -0.296509 -0.812061 -0.415904 -0.281954 -0.582304 -0.414326 -0.531489 -0.547867 -0.405439 -0.420791 -0.296450 -0.811735 -0.415908 -0.282031 -0.582433 -0.414175 -0.531347 -0.548027 -0.414472 -0.531545 -0.548040 -0.420477 -0.296248 -0.812043 -0.416439 -0.282035 -0.582631 -0.405615 -0.822119 -0.614699
chargesum: -0.00000
polarizability: 1.01964431e+03 3.19605461e-02 6.46922955e+02 9.94090048e-02 -4.48635074e-01 6.46163930e+02
temp: 298.150 k
press: 1.00000 atm
elementType: 40 40 40 40 40 40 6 6 6 6 6 6 6 6 6 6 6 6 6 6 6 6 6 6 6 6 6 6 6 6 6 6 6 6 6 6 6 6 6 6 6 6 6 6 6 6 6 6 1 1 1 1 1 1 1 1 1 1 1 1 1 1 1 1 1 1 1 1 1 1 1 1 1 1 1 1 1 1 1 1 1 1 1 1 1 1 1 1 1 1 1 1 1 1 1 1 1 1 1 1 8 8 8 8 8 8 8 8 8 8 8 8 8 8 8 8 8 8 8 8 8 8 8 8 8 8 8 8 8 8 8 8
symmnumber: 1
zpe: 2435041.2 jmol-1
zpe.correction: 0.927458 hartree
zpe.thermalcorrener: 1.008041 hartree
zpe.thermalcorrenthalpy: 1.008985 hartree
zpe.thermalcorrgfe: 0.821421 hartree
zpe.sumelectzpe: -4317.304309 hartree
zpe.sumelectthermal: -4317.223727 hartree
zpe.sumelectthermalent: -4317.222782 hartree
zpe.sumelectthermalfe: -4317.410347 hartree
dipole: 0.7136 -0.0015 0.0082
dipole: 0.7136
quadrupole: -466.2653 -530.6448 -530.5638
quadrupole: -0.0003 -0.0110 -0.0058
quadrupole: 42.8926 -21.4869 -21.4058 -0.0003 -0.0110 -0.0058
hfenergy: -4318.2317677 hartree
pointgroup: C01 [X(C42H52O32Zr6)]
dipole: -0.2807448 0.0005751 0.0032457 debye
polarizability: 1019.644311|0.0319625|646.9229551|-0.099409|0.4486351|646.1639302 unknown
InChI: InChI=1/42C.32O.6Zr.52H
charge 0 multiplicity 1
132 atoms
Zr 1.464567 0.780415 1.886821
Zr -1.494952 -0.789938 -1.875684
Zr 1.463681 -2.024374 -0.268632
Zr -1.494332 2.020859 0.252381
Zr 1.463785 1.244969 -1.620319
Zr -1.495029 -1.227359 1.622291
C  -7.084992 -4.031665 0.842922
C  -5.778185 -3.554373 0.876164
C  7.098419 -2.693768 -3.0339
C  5.789043 -2.496747 -2.603649
C  3.819512 -1.383872 1.946358
C  5.226576 -1.669373 2.366639
C  5.992635 -2.600387 1.656841
C  -3.781516 1.477428 -2.063161
C  -5.158072 1.814349 -2.543836
C  -5.865722 2.877931 -1.973751
C  7.306179 3.18387 1.45906
C  7.860883 3.817828 0.346746
C  -7.17562 3.138884 -2.366317
C  -7.78843 2.344006 -3.335335
C  -7.170179 -3.63736 -1.536782
C  -7.787702 -4.067515 -0.361947
C  -7.16981 0.479914 3.911255
C  -7.788222 1.713274 3.703899
C  7.098674 3.977099 -0.811531
C  5.788982 3.507031 -0.858142
C  7.305164 -2.864796 2.037851
C  7.861568 -2.210241 3.13734
C  3.818712 -0.994919 -2.171047
C  5.226429 -1.216031 -2.625868
C  5.994975 -0.13446 -3.069582
C  -3.782256 1.051291 2.309084
C  -5.158818 1.298544 2.842041
C  -5.860723 0.27361 3.485227
C  -7.08112 1.291415 -3.917047
C  -5.773767 1.025177 -3.52164
C  -7.087047 2.742758 3.075301
C  -5.780265 2.536557 2.643238
C  3.81808 2.378681 0.222861
C  5.225544 2.883323 0.260209
C  5.993159 2.723743 1.418875
C  -3.782556 -2.524988 -0.24707
C  -5.158122 -3.112852 -0.298041
C  -5.861034 -3.164791 -1.506466
C  7.307607 -0.332229 -3.488532
C  7.861371 -1.612932 -3.478418
C  7.10075 -1.279652 3.846765
C  5.791367 -1.005471 3.460923
H  1.129162 -1.267107 -2.983066
H  -2.032724 4.225594 -1.043712
H  -0.211946 3.178791 2.582574
H  -0.894501 4.289286 1.675858
H  0.046795 3.762309 -1.637568
H  2.008554 1.134896 -4.234504
H  0.689137 0.955332 4.45898
H  -5.217116 -3.508889 1.813206
H  5.178722 -3.332475 -2.249988
H  5.542354 -3.102993 0.796202
H  -5.377413 3.483625 -1.205558
H  8.89096 4.184524 0.380501
H  -8.819194 2.54732 -3.640001
H  -8.817952 -4.434396 -0.386082
H  -8.81833 1.873244 4.035415
H  5.17918 3.621841 -1.758703
H  8.891326 -2.422122 3.439564
H  5.546801 0.863194 -3.06799
H  -5.36823 -0.691933 3.62842
H  1.129868 3.217205 0.392527
H  -2.033622 -1.205976 4.179939
H  -0.213215 -3.825336 1.461799
H  -0.896323 -3.594139 2.876444
H  0.046872 -0.463736 4.075273
H  2.008807 3.099526 3.097558
H  0.685526 -4.338203 -1.399776
H  -5.208808 0.197519 -3.958212
H  1.128621 -1.948099 2.589125
H  -2.034793 -3.015136 -3.135232
H  -0.21315 0.647528 -4.04526
H  -0.89597 -0.693313 -4.552096
H  0.044919 -3.297188 -2.439247
H  2.007987 -4.232537 1.134011
H  0.686905 3.382102 -3.058788
H  -5.220754 3.328607 2.138596
H  5.543421 2.222917 2.280773
H  -5.369154 -2.811975 -2.41693
H  8.891156 -1.768709 -3.812985
H  5.182741 -0.277726 4.004947
H  -3.428757 0.000445 0.000224
H  -7.563119 -4.373755 1.765356
H  -7.716718 -3.664803 -2.483872
H  -7.556084 0.669622 -4.681431
H  -7.726403 3.965533 -1.908369
H  -7.566281 3.713018 2.915772
H  -7.715635 -0.329876 4.403943
H  7.904886 0.520246 -3.824834
H  7.529194 -3.699289 -3.023093
H  7.902745 3.045941 2.365506
H  7.530266 4.472805 -1.686039
H  7.900204 -3.587156 1.471553
H  7.533139 -0.763572 4.709016
O  3.301347 -2.143134 1.088002
O  3.234911 -0.402136 2.486863
O  0.871018 0.097142 4.046733
O  -0.606671 0.666888 1.610214
O  -3.276932 0.396997 -2.477768
O  -1.045313 0.098681 -4.017203
O  0.771824 -0.896971 -2.167683
O  -3.238012 -2.193983 -1.334575
O  -1.269025 -2.428117 -3.151594
O  1.275358 2.474845 3.108447
O  3.301546 0.128504 -2.399298
O  3.232615 -1.954385 -1.59335
O  0.8686 -3.553654 -1.938857
O  -0.607138 -1.727055 -0.228989
O  -3.277705 1.95025 1.580414
O  -1.044101 3.429744 2.093545
O  0.77244 2.326028 0.30544
O  -3.236037 2.253952 -1.233653
O  -1.267326 3.94514 -0.527173
O  1.274046 -3.929501 0.588313
O  -3.23667 -0.055368 2.567035
O  -1.268585 -1.514083 3.67887
O  1.274605 1.455101 -3.698723
O  3.232842 2.358363 -0.897255
O  0.87015 3.456542 -2.109845
O  -0.606935 1.062849 -1.38296
O  -3.27796 -2.342436 0.895728
O  -1.045299 -3.526359 1.92311
O  0.772135 -1.427192 1.860339
O  3.300589 2.013644 1.309469
O  1.83848 0.000497 -0.00083
O  -2.466502 0.001058 -0.000179
