program: Gaussian 16
title: title
version: ES64L-G16RevC.01
frameworkgroup: C1[X(C56H56O32Zr6)]
method: RM06
basis: Gen
operation: Freq
keyword: #pfreq=noraman
keyword: M06/gen
keyword: integral=grid=ultrafine
keyword: pseudo=read
keyword: scf=(intrep,xqc,maxconventionalcycles=150)
title: #p freq=noraman M06/gen integral=grid=ultrafine pseudo=read scf=(intre
basis: NPDir=0 NMtPBC= 1 NCelOv= 1 NCel= 1 NClECP= 1 NCelD= 1
basis: NCelK= 1 NCelE2= 1 NClLst= 1 CellRange= 0.0.
basis: One-electron integrals computed using PRISM.
basis: One-electron integral symmetry used in STVInt
converged: YES YES NO YES
title: Mulliken charges:
elementType: Zr Zr Zr Zr Zr Zr C C C C C C C C C C C C C C C C C C C C C C C C C C C C C C C C C C C C C C C C C C C C C C C C C C C C C C C C H H H H H H H H H H H H H H H H H H H H H H H H H H H H H H H H H H H H H H H H H H H H H H H H H H H H H H H H O O O O O O O O O O O O O O O O O O O O O O O O O O O O O O O O
charge: 1.521762 1.177149 1.174155 1.177177 1.550061 1.174142 -0.013121 -0.013817 -0.013473 -0.013144 -0.040552 -0.038692 -0.038520 -0.036218 -0.021235 -0.024161 -0.023017 -0.027484 -0.012861 -0.013011 -0.012970 -0.012463 0.001044 0.001317 0.001018 0.001044 -0.012185 -0.012088 -0.012455 -0.012189 -0.012938 -0.013597 -0.013699 -0.013365 -0.036388 -0.038420 -0.038821 -0.040354 -0.027358 -0.023219 -0.024012 -0.021545 -0.012214 -0.013298 -0.012846 -0.013325 0.000791 0.001218 0.001160 0.001355 -0.011836 -0.012655 -0.011891 -0.012516 0.436503 0.434176 0.436516 0.442103 0.443974 0.442101 0.434345 0.443940 0.047887 0.046190 0.046973 0.045639 0.042734 0.039438 0.041068 0.036899 0.017686 0.017820 0.017782 0.018121 0.016476 0.016555 0.016505 0.016826 0.045815 0.046938 0.046291 0.047800 0.037029 0.040749 0.039518 0.042450 0.018131 0.017783 0.017826 0.017688 0.016829 0.016492 0.016557 0.016461 0.022033 0.022197 0.022048 0.022030 0.022179 0.022344 0.022317 0.021997 0.273715 0.275160 0.250245 0.255740 0.243680 0.254908 0.241974 0.243916 0.273913 0.275323 0.243435 0.255653 0.250277 0.243810 0.241963 0.254869 -0.808358 -0.421496 -0.418054 -0.417812 -0.415985 -0.304805 -0.431484 -0.417893 -0.422812 -0.419808 -0.419886 -0.422972 -0.431372 -0.417857 -0.807698 -0.595606 -0.528936 -0.305747 -0.305596 -0.807767 -0.598957 -0.430091 -0.529717 -0.421193 -0.529874 -0.304866 -0.599084 -0.429683 -0.415724 -0.528898 -0.595542 -0.808205
chargesum: -0.00000
polarizability: 1.13445284e+03 2.85549685e-01 8.77817071e+02 -2.07715845e-02 -4.94166226e-01 7.81605457e+02
temp: 298.150 k
press: 1.00000 atm
elementType: 40 40 40 40 40 40 6 6 6 6 6 6 6 6 6 6 6 6 6 6 6 6 6 6 6 6 6 6 6 6 6 6 6 6 6 6 6 6 6 6 6 6 6 6 6 6 6 6 6 6 6 6 6 6 6 6 6 6 6 6 6 6 1 1 1 1 1 1 1 1 1 1 1 1 1 1 1 1 1 1 1 1 1 1 1 1 1 1 1 1 1 1 1 1 1 1 1 1 1 1 1 1 1 1 1 1 1 1 1 1 1 1 1 1 1 1 1 1 8 8 8 8 8 8 8 8 8 8 8 8 8 8 8 8 8 8 8 8 8 8 8 8 8 8 8 8 8 8 8 8
symmnumber: 1
zpe: 2754828.7 jmol-1
zpe.correction: 1.049259 hartree
zpe.thermalcorrener: 1.134143 hartree
zpe.thermalcorrenthalpy: 1.135088 hartree
zpe.thermalcorrgfe: 0.940716 hartree
zpe.sumelectzpe: -4852.326652 hartree
zpe.sumelectthermal: -4852.241767 hartree
zpe.sumelectthermalent: -4852.240823 hartree
zpe.sumelectthermalfe: -4852.435194 hartree
dipole: -0.1283 0.0210 -0.0033
dipole: 0.1300
quadrupole: -545.4819 -580.9633 -600.2991
quadrupole: 0.2384 0.0176 0.1499
quadrupole: 30.0995 -5.3818 -24.7177 0.2384 0.0176 0.1499
hfenergy: -4853.3759104 hartree
pointgroup: C01 [X(C56H56O32Zr6)]
dipole: -0.0504762 0.0082585 -0.0012825 debye
polarizability: 1134.4528364|0.2855522|877.8170714|-0.0207716|-0.4941662|781.6054567 unknown
InChI: InChI=1/56C.32O.6Zr.56H
charge 0 multiplicity 1
150 atoms
Zr -2.515506 -0.004074 -0.00082
Zr 0.028979 1.674744 1.875351
Zr -0.025321 -1.878298 1.674918
Zr 0.037047 -1.679138 -1.875287
Zr 2.522379 0.000125 0.000934
Zr -0.029759 1.874198 -1.67569
C  5.677271 2.773504 2.571906
C  -5.696145 2.91618 -2.401377
C  5.696354 2.821164 -2.528192
C  -5.702413 2.878701 2.434123
C  4.338849 3.016928 2.903415
C  -4.359917 3.171435 -2.733001
C  4.35527 3.064045 -2.849338
C  -4.365264 3.115878 2.774294
C  4.036524 4.071414 3.772548
C  -4.076066 4.172919 -3.668792
C  4.048742 4.109918 -3.727546
C  -4.073528 4.114596 3.710828
C  5.052862 4.868967 4.295018
C  -5.106555 4.904683 -4.256625
C  5.062327 4.898728 -4.268963
C  -5.096768 4.862131 4.290964
C  6.386289 4.625055 3.959504
C  -6.438049 4.650051 -3.91988
C  6.398652 4.655079 -3.944509
C  -6.429081 4.626193 3.945069
C  6.691801 3.570043 3.097712
C  -6.724717 3.650195 -2.988394
C  6.708273 3.608388 -3.073533
C  -6.723934 3.629251 3.012768
C  -5.688769 -2.888798 -2.437852
C  5.709367 -2.802539 2.535687
C  -5.688405 -2.926029 2.400935
C  5.69594 -2.754943 -2.573311
C  -4.351552 -3.124699 -2.778258
C  4.369374 -3.051292 2.85747
C  -4.35201 -3.180568 2.73218
C  4.358793 -3.004896 -2.905898
C  -4.057553 -4.12097 -3.71647
C  4.069703 -4.09513 3.740571
C  -4.066434 -4.180158 3.669336
C  4.065018 -4.057468 -3.780475
C  -5.079729 -4.867932 -4.298707
C  5.088139 -4.875402 4.285829
C  -5.096065 -4.911145 4.259307
C  5.087263 -4.845464 -4.306823
C  -6.411994 -4.633072 -3.952565
C  6.423476 -4.625919 3.96087
C  -6.427651 -4.657095 3.92295
C  6.419584 -4.595008 -3.970543
C  -6.709191 -3.638787 -3.018505
C  6.726086 -3.58128 3.084767
C  -6.716107 -3.659251 2.990061
C  6.716314 -3.541998 -3.102897
C  3.263702 2.240969 -2.226042
C  3.247226 2.18318 2.298052
C  3.272876 -2.236184 2.23064
C  -3.249783 -2.386182 2.091414
C  -3.253857 -2.314357 -2.149758
C  -3.2562 2.376719 -2.094028
C  3.260995 -2.179537 -2.29753
C  -3.265359 2.305635 2.147622
H  5.906555 1.951446 1.888631
H  -5.913773 2.129196 -1.674692
H  5.93045 2.006401 -1.837727
H  -5.92621 2.093216 1.70754
H  2.989524 4.264386 4.021847
H  -3.032953 4.364809 -3.934942
H  2.999906 4.305035 -3.967518
H  -3.029963 4.289926 3.986615
H  4.800837 5.693584 4.96817
H  -4.867311 5.682112 -4.988129
H  4.805362 5.716964 -4.948058
H  -4.851302 5.636074 5.024082
H  7.732634 3.36815 2.828376
H  -7.762848 3.438259 -2.716234
H  7.750951 3.405537 -2.812018
H  -7.76323 3.432523 2.733712
H  -5.913067 -2.104893 -1.70978
H  5.939126 -1.98965 1.841542
H  -5.906601 -2.14029 1.673109
H  5.920125 -1.934831 -1.885974
H  -3.013539 -4.294416 -3.99168
H  3.022171 -4.295712 3.981865
H  -3.022929 -4.370904 3.934709
H  3.019657 -4.25692 -4.031726
H  -4.833869 -5.640227 -5.033397
H  4.835477 -5.691808 4.968766
H  -4.856327 -5.68726 4.992023
H  4.840273 -5.668146 -4.984251
H  -7.748976 -3.443967 -2.740033
H  7.767396 -3.373021 2.821969
H  -7.754663 -3.448429 2.718721
H  7.755415 -3.333662 -2.831667
H  7.192753 5.276399 -4.36799
H  -7.245314 5.225403 -4.3816
H  7.221176 -5.240431 4.387403
H  7.220095 -5.215959 -4.382323
H  -7.234316 -5.231894 4.386475
H  -7.231339 5.213547 4.400362
H  -7.213498 -5.22012 -4.409691
H  7.18245 5.253722 4.368161
H  -1.935862 0.051863 -2.848995
H  1.910496 2.8656 0.054161
H  0.992144 -1.675284 4.158267
H  0.04407 -0.410733 4.067354
H  0.652206 -1.703624 -4.431508
H  -0.023983 -4.076672 -0.407122
H  -0.630445 -4.435313 1.691138
H  -0.960557 -4.17138 -1.67965
H  -1.93837 -0.058608 2.847631
H  1.92064 -2.864853 -0.052727
H  0.637829 1.701228 4.434101
H  0.045557 0.405491 -4.067855
H  0.98761 1.67389 -4.161173
H  -0.975689 4.163093 1.678716
H  -0.645348 4.428154 -1.690405
H  -0.037461 4.071906 0.407128
O  1.062106 -0.055514 1.453891
O  3.612561 -1.409322 1.338763
O  3.599768 -1.312908 -1.445068
O  3.591152 1.316514 1.447934
O  2.056899 2.414808 2.646735
O  -0.073255 3.933956 1.406306
O  -2.072859 2.62225 2.407854
O  -2.064377 2.673237 -2.38356
O  -3.607915 1.346755 1.40134
O  -3.596012 1.4508 -1.306823
O  -3.591515 -1.461715 1.303404
O  -3.599556 -1.356783 -1.403347
O  -2.060642 -2.629045 -2.408624
O  -2.057496 -2.681156 2.380456
O  -1.061908 -1.462301 -0.054541
O  -1.383591 -0.072781 2.057601
O  -0.024586 1.245399 3.902214
O  0.08825 -1.409039 3.927808
O  0.08528 1.404063 -3.929149
O  -1.067265 1.457329 0.053663
O  1.381321 2.058374 0.067597
O  2.075978 2.441417 -2.599285
O  0.026323 3.903041 -1.240393
O  3.607052 1.413726 -1.33613
O  0.038075 -3.907024 1.240179
O  -0.059419 -3.938541 -1.406332
O  1.388659 -2.059465 -0.066835
O  2.085722 -2.441553 2.602883
O  2.071755 -2.41662 -2.646383
O  -0.014233 -1.250887 -3.901955
O  -1.38111 0.06627 -2.058969
O  1.063617 0.053429 -1.453253
