program: Gaussian 16
title: Title Card Required
version: ES64L-G16RevC.01
frameworkgroup: C3V[C3(CCN),3SGV(H)]
method: RM06
basis: Gen
operation: Freq
keyword: #p
keyword: freq=noraman
keyword: gen
keyword: integral=grid=ultrafine
keyword: m06
keyword: scf=(intrep,xqc,maxconventionalcycles=150)
title: #p freq=noraman gen integral=grid=ultrafine m06 scf=(intrep,xqc,maxcon
basis: NPDir=0 NMtPBC= 1 NCelOv= 1 NCel= 1 NClECP= 1 NCelD= 1
basis: NCelK= 1 NCelE2= 1 NClLst= 1 CellRange= 0.0.
basis: One-electron integrals computed using PRISM.
basis: One-electron integral symmetry used in STVInt
basis: NBasis= 57 RedAO= T EigKep= 1.24D-03 NBF= 39 18
basis: NBsUse= 57 1.00D-06 EigRej= -1.00D+00 NBFU= 39 18
converged: NO YES YES YES
title: Mulliken charges:
elementType: C H H H C N
charge: -0.005938 0.091967 0.091964 0.091964 -0.249559 -0.020399
chargesum: 0.00000
title: Mulliken charges with hydrogens summed into heavy atoms:
elementType: C C N
charge: 0.269958 -0.249559 -0.020399
chargesum: -0.00068
polarizability: 1.78566667e+01 -1.67905032e-11 1.79097757e+01 -1.35743699e-12 -1.85670735e-02 3.43406544e+01
1716.lowfreq: -2.7133 -1.0518 -0.1110 17.1168 18.7789 76.1134 395.4310 395.7374 956.4175
frequency: 395.4262 395.7325 956.4175 1020.9048 1021.0120 1364.7352 1408.6289 1408.6547 2395.2620 3036.1384 3146.3117 3146.3382
redmass: 3.5489 3.5511 3.6723 1.4906 1.4910 1.3147 1.0360 1.0360 12.5798 1.0375 1.1042 1.1042
irintensity: 0.5672 0.5441 0.9101 4.9329 5.0054 3.1023 12.8873 12.8887 14.5313 2.4364 0.0155 0.0100
temp: 298.150 k
press: 1.00000 atm
elementType: 6 1 1 1 6 7
symmnumber: 3
zpe: 117805.6 jmol-1
zpe.correction: 0.044870 hartree
zpe.thermalcorrener: 0.048464 hartree
zpe.thermalcorrenthalpy: 0.049408 hartree
zpe.thermalcorrgfe: 0.021906 hartree
zpe.sumelectzpe: -132.509790 hartree
zpe.sumelectthermal: -132.506195 hartree
zpe.sumelectthermalent: -132.505251 hartree
zpe.sumelectthermalfe: -132.532754 hartree
dipole: -0.0000 -0.0000 -3.8372
dipole: 3.8372
quadrupole: -17.2872 -17.2872 -20.4459
quadrupole: -0.0000 0.0000 -0.0000
quadrupole: 1.0529 1.0529 -2.1058 -0.0000 0.0000 -0.0000
hfenergy: -132.5546597 hartree
pointgroup: C03V [C3(C1C1N1),3SGV(H1)]
dipole: 0. -0.0000015 -1.5096735 debye
dipolederiv: 0.0447399 0. 0. 0. 0.0474904 -0.0015447 0. -0.0016423 -0.0442843 0.1219803 0. 0. 0. 0.0038504 0.0409232 0. 0.0051421 0.0217305 0.0339367 0.0507753 0.0350946 0.0508593 0.092712 -0.020006 0.0042001 -0.002304 0.0219171 0.0339367 -0.0507754 -0.0350946 -0.0508593 0.092712 -0.020006 -0.0042001 -0.002304 0.0219171 0.0887809 0. 0. 0. 0.0868467 -0.0003763 0. 0.0004356 0.3015222 -0.3244881 0. 0. 0. -0.3241456 0.000093 0. 0.0001407 -0.3231802 unknown
polarizability: 17.8566667|0.|17.9097757|0.|-0.0185671|34.3406544 unknown
InChI: InChI=1/2C.N.3H
charge 0 multiplicity 1
6 atoms
C  0.0000 0.0000 -1.172333
H  -0.00000026 1.029878 -1.559567
H  0.89190064 -0.51493878 -1.559567
H  -0.89190038 -0.51493922 -1.559567
C  0.0000 0.0000 0.277427
N  0.0000 0.0000 1.435448
