program: Gaussian 16
title: Title Card Required
version: ES64L-G16RevC.01
frameworkgroup: C1[X(C3H7NO)]
method: RM06
basis: Gen
operation: Freq
keyword: #p
keyword: freq=noraman
keyword: gen
keyword: integral=grid=ultrafine
keyword: m06
keyword: scf=(intrep,xqc,maxconventionalcycles=150)
title: #p freq=noraman gen integral=grid=ultrafine m06 scf=(intrep,xqc,maxcon
basis: NPDir=0 NMtPBC= 1 NCelOv= 1 NCel= 1 NClECP= 1 NCelD= 1
basis: NCelK= 1 NCelE2= 1 NClLst= 1 CellRange= 0.0.
basis: One-electron integrals computed using PRISM.
basis: One-electron integral symmetry used in STVInt
basis: NBasis= 105 RedAO= T EigKep= 6.85D-03 NBF= 105
basis: NBsUse= 105 1.00D-06 EigRej= -1.00D+00 NBFU= 105
converged: YES YES NO NO
title: Mulliken charges:
elementType: C H O N C H H H C H H H
charge: 0.236112 -0.001269 -0.303222 -0.346790 0.039772 0.048248 0.076233 0.048009 0.048987 0.051598 0.050807 0.051514
chargesum: -0.00000
title: Mulliken charges with hydrogens summed into heavy atoms:
elementType: C O N C C
charge: 0.234843 -0.303222 -0.346790 0.212263 0.202906
chargesum: 0.00000
polarizability: 5.25716021e+01 -5.83817587e-01 4.52358508e+01 2.11737545e-03 3.70041823e-03 3.05758533e+01
1716.lowfreq: -0.0011 -0.0004 0.0007 2.5251 11.5311 17.3230 145.1986 184.4845 244.6285
frequency: 145.1873 184.4657 244.6278 324.2271 345.6302 390.4865 670.5545 895.8816 1026.9258 1057.1040 1084.7894 1097.9816 1150.2138 1310.0416 1377.1070 1392.9575 1409.9158 1415.0117 1417.5552 1430.0078 1447.7244 1508.3188 1866.3426 2907.5031 2988.3525 2997.1645 3069.4659 3081.4629 3127.4279 3159.0170
redmass: 1.6523 1.0627 1.5039 3.8171 2.2746 2.2962 4.9501 3.4672 1.6368 1.3242 1.6798 1.2347 1.3996 2.9361 1.1461 1.5541 1.0343 1.1899 1.5330 1.0371 1.1454 1.7559 9.6387 1.0868 1.0368 1.0379 1.1055 1.1062 1.1023 1.1018
irintensity: 0.0760 0.0253 1.1961 11.1934 17.4252 1.3707 6.7073 2.6561 1.6188 3.5073 101.7646 0.0208 1.1986 33.1437 9.0054 36.4329 4.8711 9.1301 32.2377 19.5271 22.8044 69.3852 452.8580 94.0689 52.1619 50.3502 40.4008 12.4811 10.4912 0.3195
temp: 298.150 k
press: 1.00000 atm
elementType: 6 1 8 7 6 1 1 1 6 1 1 1
symmnumber: 1
zpe: 266309.4 jmol-1
zpe.correction: 0.101432 hartree
zpe.thermalcorrener: 0.107452 hartree
zpe.thermalcorrenthalpy: 0.108396 hartree
zpe.thermalcorrgfe: 0.072532 hartree
zpe.sumelectzpe: -248.062917 hartree
zpe.sumelectthermal: -248.056897 hartree
zpe.sumelectthermalent: -248.055953 hartree
zpe.sumelectthermalfe: -248.091818 hartree
dipole: -3.7096 -0.3860 0.0002
dipole: 3.7296
quadrupole: -36.3041 -27.6422 -30.6936
quadrupole: -0.0044 -0.0007 -0.0017
quadrupole: -4.7574 3.9044 0.8530 -0.0044 -0.0007 -0.0017
hfenergy: -248.1643492 hartree
pointgroup: C01 [X(C3H7N1O1)]
dipole: -1.459457 -0.1518666 0.000083 debye
dipolederiv: 2.0988503 -0.2030702 -0.0002137 -0.1383808 0.8578706 -0.0000613 0.0000267 -0.0000822 0.248967 0.0358484 -0.065427 -0.0000156 -0.032449 -0.2480312 0.0000742 0.0001518 0.0001383 0.0464899 -1.43411 -0.0309158 0.0002079 -0.3984912 -0.5707307 0.0000688 -0.000167 0.0000858 -0.3884915 -1.2363241 0.1254524 -0.0002611 0.4104854 -0.7465996 -0.0007779 -0.0003021 0.0006713 -0.3398912 -0.0315635 -0.0740778 0.0003532 -0.1868723 0.5466714 0.0011402 0.0008441 0.0004226 0.2742675 0.0264013 0.0772292 0.0863804 0.047056 -0.0334988 -0.0001548 0.0935304 -0.0740818 -0.0756893 0.0414163 -0.103118 0.000661 -0.006792 0.063375 -0.0001667 0.0005089 0.000049 0.0960522 0.0248892 0.0779521 -0.0873628 0.0468966 -0.0327699 -0.0003004 -0.0944807 0.0731112 -0.0739316 0.6052422 0.2017247 0.0006448 0.2700675 0.1467604 0.0002747 0.0002821 -0.000125 0.2713799 -0.0887187 -0.0335192 -0.0513651 0.0102724 0.0553009 0.0650742 -0.1257818 0.0242626 -0.0765764 0.0467439 0.0608121 -0.0002666 -0.0329202 -0.0935348 0.000396 -0.0001457 0.0003857 0.0931877 -0.0886752 -0.0330425 0.0512375 0.0111274 0.0551867 -0.0655669 0.1255333 -0.0248374 -0.0757642 unknown
polarizability: 52.5716021|-0.5838181|45.2358509|0.0021174|0.0037004|30.5758533 unknown
InChI: InChI=1/3C.N.O.7H
charge 0 multiplicity 1
12 atoms
C  0.869293 -0.641489 -0.000014
H  0.752812 -1.756907 0.000323
O  1.943031 -0.091053 -0.000002
N  -0.345713 -0.020891 -0.000132
C  -0.424205 1.417903 0.000012
H  -0.953823 1.786717 0.89655
H  0.597049 1.821794 -0.005566
H  -0.963682 1.785742 -0.89095
C  -1.579399 -0.756109 0.000015
H  -2.18814 -0.525855 -0.893461
H  -1.372542 -1.837128 0.002947
H  -2.190063 -0.521531 0.891017
