program: Orca
programVersion: 5.0.4
elementType: N C C N N H H
charge: -1
multiplicity: 1
keywords: freq wB97x-D3 def2-TZVPP TightSCF defgrid3
keywords: PAL4
frequency: 0.00 0.00 0.00 0.00 0.00 0.00 694.43 755.93 778.16 821.73 978.93 980.50 1109.37 1109.70 1187.83 1215.20 1265.92 1451.08 1488.04 3205.15 3231.36
frequency: 694.43 755.93 778.16 821.73 978.93 980.50 1109.37 1109.70 1187.83 1215.20 1265.92 1451.08 1488.04 3205.15 3231.36
formula: C2H2N3
InChI: InChI=1/C2H2N3/c1-2-4-5-3-1/h1-2H
7 atoms
N  -5.904778 1.052279 -0.102443
C  -6.617829 -0.970316 0.010409
C  -7.603022 -0.124602 0.483321
N  -7.130146 1.131885 0.40105
N  -5.569273 -0.207927 -0.348216
H  -6.601271 -2.046741 -0.089986
H  -8.591756 -0.338431 0.865251
totalener: -241.68391845 hartree
nucrepener: 155.65615972 hartree
electener: -397.34007817 hartree
oneelecener: -643.38141406 hartree
twoeener: 246.04133589 hartree
kineticenergy: 240.76851481 hartree
xcener: -22.543201318876 hartree
energy: -387.3181 -386.8038 -386.8029 -274.4540 -274.4377 -26.2202 -20.4672 -18.5258 -13.5189 -12.7660 -10.8904 -9.0492 -8.9500 -6.0895 -4.1879 -4.1349 -3.9567 -3.5373 8.5232 8.7323 8.7770 8.9204 10.3176 11.6766 11.8559 12.8394 13.9056 14.0420 14.9396 15.6926 16.3534 16.9138 17.3759 17.7173 18.2570 18.3625 18.7745 20.0669 20.3048 20.5454 21.0973 21.5258 22.4949 22.6661 23.3842 23.9359 25.6734 25.7920 26.0614 28.2756 28.8086 28.8629 32.1333 32.5581 32.6991 33.7188 34.3940 34.4543 37.7254 39.8090 40.6566 41.8246 42.2620 42.5305 44.4508 46.2412 46.6573 46.7904 47.2992 48.6116 48.6845 49.1720 49.4408 49.6394 53.9087 54.1229 54.6561 55.1329 55.7344 57.1091 58.2647 59.4007 60.7256 61.6774 61.8223 64.6951 65.0001 65.2485 67.4871 72.1166 72.1794 72.2337 72.7116 74.4214 77.1063 77.4902 77.9360 81.6039 82.2993 82.3400 84.7492 85.0479 87.2548 88.4068 90.1692 90.2698 92.0924 92.6051 93.5152 93.7237 94.3927 95.5593 96.0595 97.7592 98.5584 101.6068 102.0551 103.7215 104.1884 104.4429 105.8741 106.5127 106.9694 108.4171 109.2517 111.0003 112.0452 112.2785 112.4710 114.4894 114.9405 116.0821 116.1580 117.1116 117.8094 118.9750 122.0154 124.2282 125.6399 127.2189 129.8001 131.4762 131.8006 133.4961 133.8882 134.6713 137.5094 137.6030 137.8736 138.8078 139.0602 140.6166 140.8924 141.6527 141.9684 147.5053 147.8879 148.1360 148.5185 150.0244 150.0289 151.5821 152.5941 153.6364 154.6613 155.6267 158.8029 161.1233 161.9926 163.2473 166.2951 167.3272 168.6698 170.8271 175.4924 186.3316 197.2405 198.1794 633.8369 649.1619 874.3985 881.1038 884.9018 electronvolt
chargesum: -1.0000000
charge: -0.214449 -0.196101 -0.196027 -0.245241 -0.245262 0.048544 0.048536
charge: -0.166961 -0.300661 -0.300696 -0.083237 -0.083236 -0.032629 -0.032580
qa: -0.2144 -0.1961 -0.1960 -0.2452 -0.2453 0.0485 0.0485
va: 2.8108 4.1578 4.1580 2.9793 2.9793 1.0291 1.0291
dispcorr: -0.000564281 hartree
energy: -241.684482727045
dipole: -1.93218 1.16377 -0.76841 -2.56408 1.54441 -1.01967 0.55972 -0.33713 0.22260
quadrupole: 81.49482 -109.09267 .71287 -0.61210 -0.34226 94.41971 -122.05633 -0.59296 -0.78668 0.17186 13.86009 -38.74091 0.37 -0.08 0.92 3.41071 -2.49480 4 0 3 -32.73034 34.17180 4 4 7 6.83911 -7.50625 4 3 6
magnitude: 1.29604 au
magnitude: 3.29427 debye
temp: 298.15 k
press: 1.00 atm
zeropoint: 0.04618606 hartree
thermalvibcorrection: 0.00054950 hartree
thermalrotcorrection: 0.00141627 hartree
thermaltrasncorrection: 0.00141627 hartree
thermaltotal: -241.63491463 hartree
thermalcorr: 0.00338204 hartree
nonthermalcorr: 0.04618606 hartree
totalcorr: 0.04956810 hartree
thermalcorrenthalpy: 0.00094421 hartree
totalenthalpy: -241.63397042 hartree
totalentropycorr: -0.03033698 hartree
gibbsenthalpy: -241.66430740 hartree
gibbsminuselec: 0.02017532 hartree
