program: Gaussian 09
title: 000050115
version: EM64L-G09RevD.01
frameworkgroup: C1[X(C17H27N3O4S)]
method: RPBEPBE
basis: SDD
operation: Freq
keyword: #p
keyword: freq=noraman
keyword: PBEPBE/SDD
title: #p freq=noraman PBEPBE/SDD
converged: NO YES NO NO
title: Mulliken charges:
elementType: S O O O O N N N C C C C C C C C C C C C C C C C C H H H H H H H H H H H H H H H H H H H H H H H H H H H
charge: 0.939770 -0.273441 -0.250715 -0.555938 -0.532297 -0.126131 -0.350158 -0.488361 0.001690 -0.475101 -0.469177 -0.364872 -0.462456 -0.329168 -0.695969 0.151957 0.180354 -0.452832 0.176519 0.094905 0.453982 -0.561335 -0.843630 -0.744385 -0.529660 0.237473 0.215856 0.206389 0.219253 0.225149 0.230017 0.176197 0.237229 0.257608 0.229940 0.179959 0.311846 0.212823 0.225473 0.218791 0.267341 0.263015 0.284517 0.242752 0.272946 0.229066 0.285630 0.269169 0.272902 0.213661 0.289471 0.231976
chargesum: 0.00000
title: Mulliken charges with hydrogens summed into heavy atoms:
elementType: S O O O O N N N C C C C C C C C C C C C C C C C C
charge: 0.939770 -0.273441 -0.250715 -0.555938 -0.532297 -0.126131 -0.038312 -0.203844 0.239164 -0.052856 -0.024775 0.041342 0.032381 0.080731 -0.038882 0.151957 0.180354 -0.185491 0.176519 0.094905 0.453982 -0.298320 -0.098866 0.083315 0.205448
polarizability: 3.78718402e+02 5.31418434e+01 2.93764156e+02 -1.07890026e+01 -2.65178440e+00 1.93702651e+02
1716.lowfreq: 0.0008 0.0014 0.0017 4.1512 4.4241 6.2839 12.9110 18.0996 22.3899
frequency: 12.5846 17.9842 22.3707 25.1642 38.7012 41.9266 56.6433 63.7945 75.2124 76.7590 104.4736 106.8308 128.7617 137.3156 161.4744 163.7270 165.3781 173.9311 197.8841 208.4221 219.4172 228.5452 240.1378 243.0849 254.6149 266.7661 278.4958 284.8389 304.3889 322.2503 336.5821 345.5090 361.7727 378.1357 396.5324 409.7929 444.2618 464.8696 471.9729 512.2394 555.7611 567.5604 575.4071 584.0385 601.8886 613.2990 659.1996 690.5706 724.5523 755.7381 758.0800 793.9136 796.4783 798.7072 814.9253 822.2230 876.2862 877.1832 889.0552 897.1257 918.2373 926.0646 929.6467 942.0223 959.1002 969.8502 970.4999 1002.8424 1008.5029 1014.6401 1022.9059 1048.1631 1071.9113 1090.0544 1096.8225 1105.0625 1116.9857 1121.2895 1147.4587 1151.4655 1156.5821 1164.0626 1189.6877 1191.6066 1203.0328 1204.0544 1222.2280 1244.4899 1254.3163 1269.8505 1278.1646 1282.5073 1293.0877 1297.8686 1304.3115 1309.2710 1336.9023 1343.2825 1355.3554 1378.0483 1382.0635 1388.3757 1395.3846 1408.2330 1414.3563 1417.0187 1433.3942 1447.8121 1454.3847 1463.9296 1468.8761 1469.6070 1470.3852 1473.8759 1475.1839 1476.1455 1478.1148 1482.4584 1487.4207 1496.2475 1539.6768 1585.9001 1620.4845 2837.5484 2848.8198 2918.2569 2969.9320 2979.6928 2984.1081 2998.8711 3010.6518 3017.4080 3022.3044 3033.0118 3036.2130 3044.7371 3053.5230 3079.6323 3083.2116 3087.9342 3089.3834 3091.5411 3096.9632 3133.0392 3150.6980 3155.0854 3183.2038 3192.6431 3316.0203 3557.1026
redmass: 7.2246 3.8466 4.8708 3.9591 4.7327 4.7417 3.5812 3.8121 3.8222 3.1351 3.5397 5.0210 5.0890 3.5228 1.1628 2.1842 4.6591 1.1133 3.1025 2.0013 4.4120 2.2688 2.6450 2.3475 1.7927 2.2826 2.9655 2.6484 5.6294 3.5907 3.3074 2.9062 6.0540 4.4023 4.5127 3.7973 3.0506 5.9770 3.1991 4.3028 1.6258 2.3062 6.0422 2.1985 2.4772 4.8987 5.5783 5.7749 5.2207 3.5622 3.6487 1.1948 8.4743 4.6031 2.3954 2.2147 2.9052 2.4402 1.4479 1.9908 1.4692 1.6557 1.8298 3.3500 2.1019 2.1480 1.3181 1.6815 2.1632 1.8122 1.8758 1.5538 2.1394 2.2010 2.0742 2.8606 1.3076 2.0719 1.7784 1.7031 1.5607 1.6474 1.8024 2.0618 2.3543 2.4936 1.3147 1.4347 1.7280 1.4894 1.2319 4.1972 1.2768 1.3549 1.1388 1.3015 1.3790 1.3741 1.3876 1.3791 2.9739 1.2877 3.1040 1.3401 1.0567 1.0576 1.1590 1.3065 1.0653 1.0901 1.0897 1.4853 1.2950 1.2161 1.0824 1.1643 1.2835 1.5704 1.0820 1.0902 5.5789 6.3698 6.7375 1.0716 1.0712 1.0837 1.0403 1.0336 1.0356 1.0599 1.0656 1.0598 1.0879 1.0870 1.0247 1.0963 1.1019 1.0991 1.1044 1.1049 1.1004 1.0987 1.0972 1.1055 1.0910 1.0920 1.1073 1.1071 1.0738 1.0780
irintensity: 4.7060 0.2642 0.9438 0.2940 0.2361 0.6409 0.1875 6.4253 4.9442 1.2015 7.4447 7.9612 0.5934 6.1319 0.3141 3.2410 33.0744 4.6512 3.5828 1.5794 18.6637 4.9863 1.9589 1.3457 3.4657 1.0227 2.2281 1.3056 27.1102 1.8957 24.6423 7.9689 27.6318 3.4203 14.0074 33.8802 10.0719 0.3484 3.6314 13.2553 72.8965 60.9905 41.9813 15.7843 2.3682 4.5029 1.4907 9.3818 3.4810 4.3668 3.1982 6.3320 84.5755 5.0400 5.7945 5.4414 49.4346 11.3741 15.5558 12.6134 40.5192 24.8550 15.4113 9.5736 4.7558 6.8098 50.5369 0.7543 1.6089 21.2692 22.5350 6.8954 31.0294 3.4316 19.4525 16.7716 2.8368 7.8211 36.7012 12.8611 15.3540 10.7159 95.3668 75.1520 54.6679 17.9472 1.2515 6.7019 122.4942 75.3236 16.8031 174.6390 17.6673 5.5605 6.3706 0.6673 4.6936 1.7247 11.8075 2.3765 96.5340 24.9354 28.3850 26.8691 9.0922 10.5365 50.3943 12.3663 34.4754 7.0351 29.5393 79.4971 17.8211 131.2621 11.6629 10.1012 83.2462 82.7732 3.0101 4.5507 63.9137 107.9507 245.9123 72.6912 163.7007 46.2984 16.3016 76.2735 32.0196 40.8626 30.0117 28.2788 22.3131 51.8656 0.7746 9.6580 25.4917 50.6492 49.8290 14.8187 39.3123 28.8651 15.4877 17.1191 3.3997 3.9266 0.6473 0.9990 8.7993 17.6017
temp: 298.150 k
press: 1.00000 atm
elementType: 16 8 8 8 8 7 7 7 6 6 6 6 6 6 6 6 6 6 6 6 6 6 6 6 6 1 1 1 1 1 1 1 1 1 1 1 1 1 1 1 1 1 1 1 1 1 1 1 1 1 1 1
symmnumber: 1
zpe: 1112459.1 jmol-1
zpe.correction: 0.423713 hartree
zpe.thermalcorrener: 0.452366 hartree
zpe.thermalcorrenthalpy: 0.453310 hartree
zpe.thermalcorrgfe: 0.360418 hartree
zpe.sumelectzpe: -1525.101380 hartree
zpe.sumelectthermal: -1525.072727 hartree
zpe.sumelectthermalent: -1525.071783 hartree
zpe.sumelectthermalfe: -1525.164675 hartree
dipole: 4.3318 0.1032 6.5673
dipole: 7.8680
quadrupole: -164.6595 -141.3451 -165.5896
quadrupole: 2.5942 -12.3813 -3.3919
quadrupole: -7.4614 15.8530 -8.3916 2.5942 -12.3813 -3.3919
hfenergy: -1525.5250929 hartree
pointgroup: C01 [X(C17H27N3O4S1)]
dipole: 1.6037374 0.1988226 -2.6402052 debye
polarizability: 371.2738221|-58.7477499|300.08767|-3.7886702|13.3465121|194.8237166 unknown
InChI: InChI=1S/C16H24N3O2.CH3O2S/c1-4-19-7-5-6-12(19)10-18-16(20)13-9-14(17)11(2)8-15(13)21-3;1-4(2)3/h8-9,12,17-18H,4-7,10H2,1-3H3;1H3
charge 0 multiplicity 1
52 atoms
S  -4.665853 2.096278 0.744658
O  1.091907 -0.922948 1.360505
O  -0.735171 -3.367355 0.028165
O  -6.29139 1.887209 0.843555
O  -3.693547 1.715889 2.000008
N  4.959846 0.636731 -0.067242
N  1.187842 0.438536 -0.520666
N  -3.877559 1.189458 -1.007977
C  3.693035 0.101178 -0.653886
C  3.919079 0.112516 -2.195702
C  5.169239 1.010389 -2.39671
C  5.994363 0.714162 -1.128416
C  2.510818 0.991175 -0.18088
C  5.373151 0.013583 1.208084
C  6.449575 0.830542 1.945619
C  0.547303 -0.476952 0.299067
C  -0.855699 -0.837858 -0.128839
C  -1.739587 0.228304 -0.417074
C  -1.402468 -2.163239 -0.138804
C  -3.118081 0.041227 -0.693595
C  -3.671497 -1.28978 -0.624219
C  -2.797104 -2.351661 -0.370689
C  -5.157156 -1.522689 -0.81416
C  -4.351527 3.925448 0.307759
C  0.733644 -3.482372 0.02015
H  3.490069 -0.934475 -0.298511
H  4.129987 -0.910505 -2.557722
H  3.035953 0.480739 -2.749842
H  4.886095 2.078483 -2.415347
H  5.718727 0.781208 -3.32579
H  6.732887 1.505109 -0.906562
H  6.552297 -0.25087 -1.244586
H  2.610383 1.997625 -0.625667
H  2.562828 1.091368 0.916974
H  4.476535 -0.071404 1.850257
H  5.748054 -1.030707 1.042947
H  0.74623 0.699772 -1.4032
H  6.686123 0.36425 2.919427
H  6.091914 1.85979 2.125296
H  7.387468 0.887947 1.363974
H  -1.36833 1.258442 -0.399497
H  -3.164118 -3.382482 -0.342691
H  -4.803011 0.928681 -1.411806
H  -5.409293 -2.587065 -0.682086
H  -5.751907 -0.940486 -0.084633
H  -5.49827 -1.226423 -1.826044
H  -4.706681 4.504651 1.171615
H  -4.927359 4.134384 -0.603436
H  -3.269612 4.019836 0.15023
H  1.16583 -2.924673 -0.832521
H  1.155955 -3.1014 0.962946
H  0.919682 -4.559865 -0.102036
