program: Orca
programVersion: 5.0.2
elementType: C C H H N N N K K
charge: 1
multiplicity: 1
keywords: opt freq wB97X-D3 def2-TZVPP TightSCF def2/J def2-TZVP/C RIJCOSX defgrid3
keywords: PAL8
frequency: 0.00 0.00 0.00 0.00 0.00 0.00 38.33 51.42 104.63 155.03 159.47 236.55 703.12 715.24 897.91 899.86 1008.63 1013.44 1081.62 1190.09 1244.12 1318.82 1341.34 1474.65 1568.19 3245.28 3249.62
frequency: 38.33 51.42 104.63 155.03 159.47 236.55 703.12 715.24 897.91 899.86 1008.63 1013.44 1081.62 1190.09 1244.12 1318.82 1341.34 1474.65 1568.19 3245.28 3249.62
formula: C2H2N3K2
InChI: InChI=1/C2H2N3.2K/c1-3-2-5-4-1;;/h1-2H;;/q-3;+1;+2/rC2H2K2N3/c3-5-1-6-4-7(6)2-5/h1-2H
9 atoms
C  0.24143 -1.043699 0.028004
C  0.241937 1.043121 0.027836
H  0.550016 -2.07901 0.033183
H  0.55099 2.078281 0.032854
N  -1.022706 0.683544 0.004306
N  1.095921 -0.000488 0.044158
N  -1.023049 -0.683576 0.00442
K  3.721548 -0.00575 0.100113
K  -3.538507 0.001076 -0.091514
totalener: -1441.42867809 hartree
nucrepener: 412.88349826 hartree
electener: -1854.31217635 hartree
oneelecener: -2790.78654270 hartree
twoeener: 936.47436634 hartree
kineticenergy: 1439.05545736 hartree
xcener: -72.626402303808 hartree
energy: -3538.0367 -3537.1464 -394.8805 -394.8753 -394.5609 -366.1452 -365.2454 -293.5454 -293.5449 -293.5447 -292.6463 -292.6458 -292.6457 -283.0043 -283.0034 -44.3295 -43.4321 -33.9465 -29.1221 -26.9437 -26.8125 -26.8013 -26.6639 -25.9225 -25.8729 -25.8381 -21.3988 -21.2558 -18.9226 -17.1467 -16.2190 -14.6395 -12.9545 -12.6006 -12.5052 -11.6316 -2.5134 -1.9863 -0.8813 -0.8041 -0.4862 -0.2645 -0.1728 -0.1687 0.1383 0.4175 0.5150 0.6970 0.8473 0.8804 1.0565 1.2246 1.3631 1.6965 1.8794 2.0443 2.0641 2.9890 3.4464 3.5408 5.0858 5.6782 5.8717 5.8866 5.9437 6.0129 6.3883 6.4897 6.5116 6.5828 6.7295 6.9413 7.0707 7.1380 7.5862 7.9502 8.3659 9.3328 10.5269 10.7488 11.3693 11.7213 12.1891 12.9153 12.9254 13.3426 13.3471 13.8291 14.0674 14.2655 15.1278 15.3002 15.7317 16.3811 16.4357 16.5158 17.8268 18.1184 18.1642 19.4993 20.3037 20.4524 20.5962 21.1306 22.5347 22.7466 22.8169 26.0050 26.5537 26.7504 27.2268 27.7177 29.6344 29.8539 29.9630 30.5052 30.5620 30.8530 30.8982 30.9729 31.1494 31.6773 31.9484 32.7736 33.1297 34.6241 34.9867 36.0471 37.2329 37.5081 38.7119 39.2131 40.6180 40.8039 41.3740 41.5348 42.0470 42.4989 43.3072 44.3254 46.0213 46.1081 46.8922 48.1923 49.0746 49.4635 49.4736 50.7968 50.9538 53.3218 54.7536 57.4123 58.2737 59.9183 61.8038 62.8523 63.4971 63.9245 65.1245 68.2626 69.9002 72.0230 73.0908 74.6197 77.8274 78.1345 78.9430 79.4338 79.4655 79.8319 79.9252 81.3544 82.9016 84.3488 86.3075 86.6065 86.7242 87.3817 87.5129 88.8771 90.8046 91.2997 92.0472 95.3928 95.7945 97.6216 97.7770 98.5402 98.6976 100.4890 101.3287 103.4208 103.8395 104.3177 104.5403 105.2482 107.4364 107.9695 108.7744 109.2528 110.1252 110.5284 112.9305 114.2699 120.1285 123.0337 123.6497 125.6630 127.3224 127.5203 127.7917 129.2598 130.0159 131.1685 131.7881 133.9466 134.5509 134.9869 136.6606 136.6941 137.2844 139.1921 140.1219 140.7491 141.5823 142.2549 142.3988 143.5613 145.7163 146.2116 146.3160 149.8158 149.8582 152.0366 153.0747 153.9252 154.5608 154.9091 156.5334 162.8836 166.1539 168.8032 176.9872 190.4717 635.9718 644.2666 873.0915 876.1729 879.4571 electronvolt
chargesum: 1.0000000
charge: 0.105581 0.105254 0.111365 0.111522 -0.333246 -0.575280 -0.333253 0.919949 0.888109
charge: -0.260966 -0.260861 0.006116 0.006111 -0.003511 0.039499 -0.003495 0.782270 0.694837
qa: 0.1056 0.1053 0.1114 0.1115 -0.3332 -0.5753 -0.3333 0.9199 0.8881
va: 4.0129 4.0134 1.0074 1.0074 2.8195 2.8541 2.8197 0.1625 0.2372
dispcorr: -0.002170229 hartree
energy: -1441.478203496799
dipole: 0.84428 0.43931 1.28358 0.00385 -0.00854 -0.00469 0.05507 -0.07597 -0.02091
magnitude: 1.28376 au
magnitude: 3.26307 debye
temp: 298.15 k
press: 1.00 atm
zeropoint: 0.04943024 hartree
thermalvibcorrection: 0.00466912 hartree
thermalrotcorrection: 0.00141627 hartree
thermaltrasncorrection: 0.00141627 hartree
thermaltotal: -1441.42127159 hartree
thermalcorr: 0.00750166 hartree
nonthermalcorr: 0.04943024 hartree
totalcorr: 0.05693191 hartree
thermalcorrenthalpy: 0.00094421 hartree
totalenthalpy: -1441.42032738 hartree
totalentropycorr: -0.04227928 hartree
gibbsenthalpy: -1441.46260666 hartree
gibbsminuselec: 0.01559684 hartree
