program: Orca
programVersion: 5.0.2
elementType: Na C C H H N N N Na C C H H N N N C C H H N N N Na
charge: 0
multiplicity: 1
keywords: opt freq wB97X-D3 def2-TZVPP TightSCF RIJCOSX defgrid3 CHELPG
keywords: PAL8
frequency: 0.00 0.00 0.00 0.00 0.00 0.00 21.41 26.59 40.14 46.51 52.42 63.05 73.23 88.31 95.27 97.37 104.63 113.97 115.64 130.05 135.01 156.88 183.22 248.03 268.42 285.22 312.37 702.09 705.65 716.14 717.02 718.69 725.49 896.63 897.85 900.76 905.47 906.92 913.14 990.38 999.92 1005.40 1007.75 1010.39 1034.21 1078.04 1086.02 1099.18 1181.90 1193.57 1214.81 1226.44 1234.46 1245.17 1308.40 1323.36 1324.92 1325.41 1340.31 1350.30 1430.95 1465.87 1470.02 1553.00 1567.78 1572.87 3232.83 3238.49 3241.95 3243.00 3252.90 3257.18
frequency: 21.41 26.59 40.14 46.51 52.42 63.05 73.23 88.31 95.27 97.37 104.63 113.97 115.64 130.05 135.01 156.88 183.22 248.03 268.42 285.22 312.37 702.09 705.65 716.14 717.02 718.69 725.49 896.63 897.85 900.76 905.47 906.92 913.14 990.38 999.92 1005.40 1007.75 1010.39 1034.21 1078.04 1086.02 1099.18 1181.90 1193.57 1214.81 1226.44 1234.46 1245.17 1308.40 1323.36 1324.92 1325.41 1340.31 1350.30 1430.95 1465.87 1470.02 1553.00 1567.78 1572.87 3232.83 3238.49 3241.95 3243.00 3252.90 3257.18
formula: C6H6N9Na3
InChI: InChI=1/3C2H2N3.3Na/c3*1-3-2-5-4-1;;;/h3*1-2H;;;/q2*-3;-2;+2;2*+3/rC6H6N9Na3/c1-7-2-11-10(1)17-12-3-8(4-13(12)17)16-9-5-14-15(6-9)18(11)14/h1-6H
24 atoms
Na 1.618066 -2.421328 0.332078
C  -1.644833 -1.164254 -0.889615
C  -1.957405 -2.147737 0.923224
H  -1.794842 -0.626606 -1.814021
H  -2.422073 -2.595187 1.789051
N  -0.657477 -2.1629 0.729157
N  -2.639967 -1.527908 -0.060448
N  -0.449255 -1.512026 -0.459428
Na 0.835376 0.871631 -0.34567
C  -2.468747 2.211333 -1.074041
C  -2.286188 1.929045 0.982539
H  -2.870836 2.37275 -2.06423
H  -2.503711 1.807483 2.034337
N  -1.057201 1.953253 0.51226
N  -3.232504 2.080917 0.031649
N  -1.174955 2.137665 -0.834604
C  4.128397 0.843553 -0.136894
C  4.814424 -1.078172 0.180105
H  4.086693 1.912372 -0.29599
H  5.454903 -1.934304 0.3374
N  3.493708 -1.181399 0.135709
N  5.269923 0.166472 0.014665
N  3.036705 0.090523 -0.074244
Na -4.325613 0.049799 0.039885
totalener: -1212.11110281 hartree
nucrepener: 1372.38519612 hartree
electener: -2584.49629893 hartree
oneelecener: -4404.00846447 hartree
twoeener: 1819.51216554 hartree
kineticenergy: 1207.23265226 hartree
xcener: -99.171849208859 hartree
chargesum: -0.0000000
charge: 0.839676 0.132225 0.078962 0.119871 0.115203 -0.310212 -0.528692 -0.372657 0.760644 0.028251 0.074354 0.120405 0.114530 -0.283322 -0.512936 -0.274019 0.076375 0.066219 0.093640 0.098614 -0.441621 -0.384678 -0.363434 0.752603
charge: 0.262890 -0.213816 -0.235678 0.021178 0.007028 0.075929 0.109865 0.096736 0.136273 -0.260674 -0.248430 0.005805 0.010598 0.073275 0.094968 0.064237 -0.266781 -0.270781 0.002484 -0.001901 0.031615 0.074365 0.052553 0.378266
qa: 0.8397 0.1322 0.0790 0.1199 0.1152 -0.3102 -0.5287 -0.3727 0.7606 0.0283 0.0744 0.1204 0.1145 -0.2833 -0.5129 -0.2740 0.0764 0.0662 0.0936 0.0986 -0.4416 -0.3847 -0.3634 0.7526
va: 0.3456 3.9011 4.0071 1.0100 1.0072 2.8028 2.8615 2.7471 0.4574 3.9552 3.9111 1.0061 1.0049 2.7738 2.8262 2.7750 4.0818 4.0742 1.0125 1.0110 2.8911 3.0384 2.8353 0.4701
dispcorr: -0.010875240 hartree
energy: -1212.122529090883
dipole: 1.67927 -6.15412 -4.47485 2.52880 -4.44223 -1.91343 -0.04038 0.12107 0.08069
magnitude: 4.86745 au
magnitude: 12.37206 debye
temp: 298.15 k
press: 1.00 atm
zeropoint: 0.14915336 hartree
thermalvibcorrection: 0.01608505 hartree
thermalrotcorrection: 0.00141627 hartree
thermaltrasncorrection: 0.00141627 hartree
thermaltotal: -1211.95445814 hartree
thermalcorr: 0.01891759 hartree
nonthermalcorr: 0.14915336 hartree
totalcorr: 0.16807095 hartree
thermalcorrenthalpy: 0.00094421 hartree
totalenthalpy: -1211.95351393 hartree
totalentropycorr: -0.06758952 hartree
gibbsenthalpy: -1212.02110345 hartree
gibbsminuselec: 0.10142564 hartree
