program: Orca
programVersion: 5.0.2
elementType: N Na Na C C N N N C C N N Na N C C N N Na H H H H H H
charge: 1
multiplicity: 1
keywords: opt freq wB97X-D3 def2-TZVPP TightSCF def2/J def2-TZVP/C RIJCOSX defgrid3
keywords: PAL8
frequency: 0.00 0.00 0.00 0.00 0.00 0.00 26.36 26.80 34.19 55.38 58.46 74.79 76.75 84.27 85.51 86.02 88.89 89.56 108.09 108.39 119.32 155.02 175.75 176.21 180.83 238.29 238.72 271.00 281.13 281.34 688.51 688.78 688.82 755.95 756.01 756.29 832.56 832.64 833.01 913.48 913.54 913.64 995.17 995.44 995.46 1019.68 1019.90 1019.91 1134.06 1134.14 1134.74 1142.48 1145.12 1145.21 1237.32 1237.37 1238.35 1268.92 1269.83 1269.92 1282.88 1282.93 1283.82 1490.68 1491.45 1491.61 1514.74 1514.93 1515.22 3274.28 3274.37 3274.49 3293.58 3293.68 3293.85
frequency: 26.36 26.80 34.19 55.38 58.46 74.79 76.75 84.27 85.51 86.02 88.89 89.56 108.09 108.39 119.32 155.02 175.75 176.21 180.83 238.29 238.72 271.00 281.13 281.34 688.51 688.78 688.82 755.95 756.01 756.29 832.56 832.64 833.01 913.48 913.54 913.64 995.17 995.44 995.46 1019.68 1019.90 1019.91 1134.06 1134.14 1134.74 1142.48 1145.12 1145.21 1237.32 1237.37 1238.35 1268.92 1269.83 1269.92 1282.88 1282.93 1283.82 1490.68 1491.45 1491.61 1514.74 1514.93 1515.22 3274.28 3274.37 3274.49 3293.58 3293.68 3293.85
formula: C6H6N9Na4
InChI: InChI=1/3C2H2N3.4Na/c3*1-2-4-5-3-1;;;;/h3*1-2H;;;;/q3*-3;3*+2;+3/rC6H6N9Na4/c1-2-8-13-7(1)16-9-3-4-11-14(9)19(13)15-10(17-8)5-6-12(15)18-11/h1-6H
25 atoms
N  -4.032946 4.041314 -0.122942
Na -1.215058 2.745047 -0.320882
Na -2.855988 5.964033 -0.786114
C  -4.553703 1.969753 0.116029
C  -5.680389 2.734097 0.3208
N  -5.324614 4.01816 0.166172
N  -3.54525 2.811077 -0.157034
N  -0.530986 5.76884 -0.508528
C  1.448929 4.933465 -0.552315
C  1.550286 6.30447 -0.476947
N  0.302419 6.795761 -0.450266
N  0.14227 4.630649 -0.569155
Na -0.755546 8.824108 0.029692
N  -3.748453 7.947446 0.104441
C  -5.168658 9.438719 0.719833
C  -3.935428 10.034761 0.581265
N  -3.072133 9.081805 0.198654
N  -5.020008 8.14046 0.417347
Na -6.20252 6.136048 0.621305
H  -3.635788 11.058696 0.728961
H  -6.117231 9.859223 1.008395
H  2.421131 6.937356 -0.444107
H  2.216739 4.179368 -0.594608
H  -4.421933 0.901306 0.148291
H  -6.688567 2.439727 0.559334
totalener: -1374.24541923 hartree
nucrepener: 1519.59091752 hartree
electener: -2893.83633674 hartree
oneelecener: -4909.98462032 hartree
twoeener: 2016.14828358 hartree
kineticenergy: 1368.71927682 hartree
xcener: -109.601590845340 hartree
chargesum: 1.0000000
charge: -0.193389 0.887880 0.885221 -0.067145 -0.067066 -0.394486 -0.394912 -0.194115 -0.067360 -0.066586 -0.394379 -0.394950 0.886918 -0.193801 -0.068433 -0.065783 -0.393767 -0.395728 0.887132 0.133723 0.134562 0.134097 0.134099 0.134064 0.134203
charge: 0.001110 0.439782 0.185481 -0.150772 -0.150746 0.054537 0.054455 0.001058 -0.150665 -0.150851 0.054449 0.054530 0.440748 0.001160 -0.150548 -0.150877 0.054376 0.054646 0.438837 0.011514 0.011599 0.011544 0.011557 0.011533 0.011547
qa: -0.1934 0.8879 0.8852 -0.0671 -0.0671 -0.3945 -0.3949 -0.1941 -0.0674 -0.0666 -0.3944 -0.3950 0.8869 -0.1938 -0.0684 -0.0658 -0.3938 -0.3957 0.8871 0.1337 0.1346 0.1341 0.1341 0.1341 0.1342
va: 2.7338 0.2421 0.2408 4.0487 4.0478 2.9378 2.9395 2.7331 4.0486 4.0476 2.9380 2.9387 0.2433 2.7336 4.0503 4.0463 2.9384 2.9387 0.2433 1.0098 1.0095 1.0096 1.0096 1.0096 1.0096
dispcorr: -0.011508638 hartree
energy: -1374.256928477355
dipole: 0.28071 -0.20996 0.07075 -0.11030 0.09806 -0.01225 1.82338 -1.48929 0.33409
magnitude: 0.34172 au
magnitude: 0.86857 debye
temp: 298.15 k
press: 1.00 atm
zeropoint: 0.14960693 hartree
thermalvibcorrection: 0.01803674 hartree
thermalrotcorrection: 0.00141627 hartree
thermaltrasncorrection: 0.00141627 hartree
thermaltotal: -1374.08645227 hartree
thermalcorr: 0.02086928 hartree
nonthermalcorr: 0.14960693 hartree
totalcorr: 0.17047621 hartree
thermalcorrenthalpy: 0.00094421 hartree
totalenthalpy: -1374.08550806 hartree
totalentropycorr: -0.07162603 hartree
gibbsenthalpy: -1374.15713409 hartree
gibbsminuselec: 0.09979439 hartree
