program: Orca
programVersion: 6.0.0
elementType: B B B B B B B B B B F F F F F F F F F F F F B B H
charge: -1
multiplicity: 1
keywords: opt freq wB97x-D3BJ def2-TZVPPD TightSCF defgrid3 RIJCOSX
keywords: PAL8
frequency: 0.00 0.00 0.00 0.00 0.00 0.00 148.69 165.74 169.87 170.35 170.74 172.14 172.91 178.09 178.57 181.24 181.55 182.77 186.71 187.00 188.25 188.30 213.66 223.81 233.20 236.62 264.05 372.20 394.45 403.23 404.64 405.04 426.58 474.06 486.79 488.51 538.09 551.98 559.39 648.64 654.83 660.72 671.60 678.70 687.83 728.04 744.08 771.54 773.52 777.21 783.76 792.89 806.68 810.61 821.26 833.16 842.30 847.42 872.09 931.27 966.17 1027.81 1087.38 1227.06 1233.32 1234.10 1243.41 1253.11 1259.70 1270.92 1294.50 1300.82 1347.02 1357.80 1996.91
frequency: 148.69 165.74 169.87 170.35 170.74 172.14 172.91 178.09 178.57 181.24 181.55 182.77 186.71 187.00 188.25 188.30 213.66 223.81 233.20 236.62 264.05 372.20 394.45 403.23 404.64 405.04 426.58 474.06 486.79 488.51 538.09 551.98 559.39 648.64 654.83 660.72 671.60 678.70 687.83 728.04 744.08 771.54 773.52 777.21 783.76 792.89 806.68 810.61 821.26 833.16 842.30 847.42 872.09 931.27 966.17 1027.81 1087.38 1227.06 1233.32 1234.10 1243.41 1253.11 1259.70 1270.92 1294.50 1300.82 1347.02 1357.80 1996.91
formula: HB12F12
InChI: InChI=1/B12F12H/c13-1-2(14)3(1,15)5(1,17)6(1,18)4(1,2,16)8(2,20)7(2,3,19)9(3,5,21)11(5,6,23)10(4,6,8,22)12(7,8,9,11)24/h13H
25 atoms
B  -1.061981 0.443974 0.047993
B  -1.826658 -1.515513 2.102748
B  -2.177784 0.132002 2.746131
B  -1.705134 1.292575 1.471978
B  -0.053404 -1.579367 1.826762
B  0.032202 1.278225 1.199864
B  -0.665347 1.085152 2.876492
B  -0.704805 -0.690736 3.254932
B  -2.358056 -0.241434 1.036338
B  0.408157 -0.379932 0.564946
F  -3.304359 0.399463 3.495924
F  -0.471657 2.0281 3.854741
F  -2.791501 2.222183 1.1383
F  -3.740714 0.208701 0.523776
F  -2.572821 -2.612448 2.451096
F  -0.522843 -1.157855 4.533392
F  1.463929 -0.599511 -0.28507
F  0.635729 -2.757807 1.972932
F  1.917714 0.096078 2.838645
F  -1.335601 -2.262062 -0.56107
F  -1.365745 0.942134 -1.202218
F  0.775823 2.375794 0.845429
B  0.65453 0.006404 2.307648
B  -1.132386 -1.320337 0.415184
H  -3.569046 1.238644 0.712493
totalener: -1498.46099976210621 hartree
nucrepener: 2205.83365809244060 hartree
electener: -3704.29465964922792 hartree
oneelecener: -6492.97599247824382 hartree
twoeener: 2788.68133282901590 hartree
kineticenergy: 1492.82573110496332 hartree
exchangeener: -117.650795083144 hartree
correlationener: -7.591755319504 hartree
xcener: -125.242550402648 hartree
energy: -674.3519 -672.8767 -670.6656 -670.6609 -670.4271 -670.4248 -670.3215 -670.3147 -670.1091 -670.1073 -670.0627 -670.0232 -185.3720 -185.1598 -184.8171 -184.8109 -184.7809 -184.7782 -184.7092 -184.6992 -184.4475 -184.4412 -184.4047 -184.3613 -36.9153 -34.9113 -33.0389 -33.0333 -32.8560 -32.7805 -32.7550 -32.6752 -32.5402 -32.4824 -32.4108 -32.3758 -23.0521 -19.1130 -19.0512 -18.6968 -18.6662 -16.7778 -16.1487 -15.8886 -15.3157 -15.1526 -14.8071 -14.7709 -14.5092 -14.1837 -14.1243 -14.0341 -13.9487 -13.7117 -13.5777 -13.5473 -13.1857 -13.0227 -12.9860 -12.9608 -12.9350 -12.9337 -12.8782 -12.4703 -12.4479 -11.8651 -11.8270 -11.6279 -11.5816 -11.5611 -11.5096 -11.4633 -11.4179 -11.1893 -11.1444 -11.1313 -10.0268 -9.8713 -9.8011 -9.6381 -9.5595 -6.8968 -6.6890 -6.6327 -6.5347 2.4702 3.4861 3.6044 3.7253 4.1601 4.1878 4.2212 4.2219 4.2417 4.2773 4.8325 electronvolt
chargesum: -1.0000000
charge: -0.055489 0.175363 -0.034492 0.760156 0.553596 0.233029 0.255527 0.515676 0.792781 0.523974 -0.505425 -0.535053 -0.292113 -0.115941 -0.534606 -0.527486 -0.526969 -0.536911 -0.545028 -0.533866 -0.505683 -0.535623 0.490714 0.200739 0.283131
charge: -0.350135 -0.326331 -0.351030 -0.231571 -0.334711 -0.324667 -0.324805 -0.333123 -0.143246 -0.332190 0.207321 0.210605 0.284382 0.463696 0.211833 0.213881 0.213838 0.216013 0.215766 0.211575 0.206677 0.210872 -0.335711 -0.324711 -0.154229
qa: -0.0555 0.1754 -0.0345 0.7602 0.5536 0.2330 0.2555 0.5157 0.7928 0.5240 -0.5054 -0.5351 -0.2921 -0.1159 -0.5346 -0.5275 -0.5270 -0.5369 -0.5450 -0.5339 -0.5057 -0.5356 0.4907 0.2007 0.2831
va: 5.4183 5.1209 5.3499 5.1199 5.1304 5.1607 5.1397 5.1738 4.7752 5.1611 0.9401 1.0908 1.1159 1.4079 1.0937 1.0846 1.0834 1.0351 1.0304 1.0951 0.9430 1.0926 5.1970 5.0902 1.2139
dispcorr: -0.098440097 hartree
energy: -1498.729277308184
temp: 298.15 k
press: 1.00 atm
zeropoint: 0.10191929 hartree
thermalvibcorrection: 0.01741656 hartree
thermalrotcorrection: 0.00141627 hartree
thermaltrasncorrection: 0.00141627 hartree
thermaltotal: -1498.60710891 hartree
thermalcorr: 0.02024910 hartree
nonthermalcorr: 0.10191929 hartree
totalcorr: 0.12216839 hartree
thermalcorrenthalpy: 0.00094421 hartree
totalenthalpy: -1498.60616470 hartree
totalentropycorr: -0.06633998 hartree
gibbsenthalpy: -1498.67250468 hartree
gibbsminuselec: 0.05677262 hartree
