program: Orca
programVersion: 6.0.0
elementType: C H H H H H N B B B B B B B B B B F F F F F F F F F F F F B B C H H C H H C H H C H H C H H C H H C H H C H H C H H C H H C H H N H H
charge: -1
multiplicity: 1
keywords: opt freq wB97x-D3BJ def2-TZVPP TightSCF defgrid3 RIJCOSX
keywords: PAL8
frequency: 0.00 0.00 0.00 0.00 0.00 0.00 21.26 25.76 27.92 34.19 49.29 52.35 59.52 65.54 68.30 86.33 95.11 104.98 121.83 128.06 135.27 143.15 148.05 169.69 171.01 171.46 171.98 172.85 175.56 176.42 177.17 183.91 184.03 186.33 187.84 188.25 189.47 191.49 194.98 209.40 214.36 219.79 231.25 234.86 236.53 246.99 260.35 288.64 298.89 306.47 327.59 352.49 388.05 399.31 399.81 400.03 400.71 403.30 412.76 435.83 444.05 484.06 484.98 486.36 488.54 492.25 544.09 558.09 562.64 563.52 671.95 673.32 677.26 678.17 678.63 727.71 735.15 742.38 744.67 748.50 749.29 757.11 803.72 807.11 808.35 809.43 812.06 814.63 816.38 819.18 829.40 830.21 832.78 838.96 842.19 843.64 846.25 851.49 875.86 911.82 926.20 933.85 948.63 965.46 990.30 1020.88 1033.46 1045.20 1059.20 1065.57 1078.83 1082.98 1102.90 1104.88 1112.32 1114.57 1117.37 1135.66 1155.95 1158.47 1171.09 1200.47 1205.37 1217.36 1219.82 1223.57 1231.26 1238.86 1240.71 1243.78 1267.82 1268.35 1273.03 1284.90 1287.36 1294.32 1299.26 1318.58 1319.61 1330.01 1342.66 1345.37 1347.17 1351.43 1355.44 1360.80 1377.14 1384.32 1391.00 1397.88 1400.73 1426.32 1432.58 1436.37 1442.56 1453.15 1488.16 1490.45 1493.82 1495.29 1495.38 1497.70 1500.57 1507.57 1513.51 1515.47 1518.35 1519.09 1618.43 1683.78 1686.54 1691.75 3018.50 3021.99 3025.36 3031.42 3032.47 3038.45 3040.97 3046.80 3048.16 3052.24 3056.46 3059.91 3063.72 3068.44 3070.84 3071.56 3079.93 3092.22 3104.70 3119.37 3124.01 3130.84 3148.77 3151.98 3220.02 3264.80 3502.95 3533.17 3599.81
frequency: 21.26 25.76 27.92 34.19 49.29 52.35 59.52 65.54 68.30 86.33 95.11 104.98 121.83 128.06 135.27 143.15 148.05 169.69 171.01 171.46 171.98 172.85 175.56 176.42 177.17 183.91 184.03 186.33 187.84 188.25 189.47 191.49 194.98 209.40 214.36 219.79 231.25 234.86 236.53 246.99 260.35 288.64 298.89 306.47 327.59 352.49 388.05 399.31 399.81 400.03 400.71 403.30 412.76 435.83 444.05 484.06 484.98 486.36 488.54 492.25 544.09 558.09 562.64 563.52 671.95 673.32 677.26 678.17 678.63 727.71 735.15 742.38 744.67 748.50 749.29 757.11 803.72 807.11 808.35 809.43 812.06 814.63 816.38 819.18 829.40 830.21 832.78 838.96 842.19 843.64 846.25 851.49 875.86 911.82 926.20 933.85 948.63 965.46 990.30 1020.88 1033.46 1045.20 1059.20 1065.57 1078.83 1082.98 1102.90 1104.88 1112.32 1114.57 1117.37 1135.66 1155.95 1158.47 1171.09 1200.47 1205.37 1217.36 1219.82 1223.57 1231.26 1238.86 1240.71 1243.78 1267.82 1268.35 1273.03 1284.90 1287.36 1294.32 1299.26 1318.58 1319.61 1330.01 1342.66 1345.37 1347.17 1351.43 1355.44 1360.80 1377.14 1384.32 1391.00 1397.88 1400.73 1426.32 1432.58 1436.37 1442.56 1453.15 1488.16 1490.45 1493.82 1495.29 1495.38 1497.70 1500.57 1507.57 1513.51 1515.47 1518.35 1519.09 1618.43 1683.78 1686.54 1691.75 3018.50 3021.99 3025.36 3031.42 3032.47 3038.45 3040.97 3046.80 3048.16 3052.24 3056.46 3059.91 3063.72 3068.44 3070.84 3071.56 3079.93 3092.22 3104.70 3119.37 3124.01 3130.84 3148.77 3151.98 3220.02 3264.80 3502.95 3533.17 3599.81
formula: C12H29B12F12N2
InChI: InChI=1/C12H29N2.B12F12/c13-11-9-7-5-3-1-2-4-6-8-10-12-14;13-1-2(14)3(1,15)5(1,17)6(1,18)4(1,2,16)8(2,20)7(2,3,19)9(3,5,21)11(5,6,23)10(4,6,8,22)12(7,8,9,11)24/h1-13H2,14H3;
67 atoms
C  5.246276 0.294058 -0.568653
H  5.52115 0.087242 -1.604308
H  5.974995 0.988688 -0.149696
H  3.532732 1.115928 0.359368
H  3.932281 1.910738 -1.020817
H  3.199277 0.450251 -1.085318
N  3.930615 0.986069 -0.58877
B  0.346873 3.109544 0.912858
B  -0.2782 1.904129 -1.656863
B  -1.813745 2.151305 -0.772628
B  -1.428436 2.898575 0.815446
B  0.687638 0.749138 -0.710955
B  -0.442298 1.731252 1.754139
B  -1.770974 1.139679 0.708984
B  -1.063582 0.525676 -0.816225
B  -0.503424 3.371546 -0.648264
B  1.071474 1.484798 0.862167
F  -2.996706 2.408357 -1.430152
F  -2.919803 0.580675 1.240033
F  -2.295645 3.769678 1.434953
F  -0.598508 4.624978 -1.212408
F  -0.166634 1.95436 -3.032175
F  -1.607991 -0.532426 -1.519023
F  2.300749 1.199272 1.517304
F  1.598574 -0.134091 -1.350847
F  -0.058021 -0.992778 1.299183
F  2.24058 3.005492 -1.143458
F  0.960033 4.135745 1.603554
F  -0.483234 1.651535 3.12942
B  -0.21558 0.265039 0.744179
B  1.041595 2.489414 -0.608453
C  5.171239 -0.989856 0.248146
H  6.167847 -1.441688 0.242753
H  4.94517 -0.738993 1.28985
C  4.134628 -1.980333 -0.276985
H  3.143071 -1.531366 -0.22288
H  4.325728 -2.186328 -1.337513
C  4.111021 -3.295477 0.498493
H  3.98306 -3.077067 1.564912
H  5.08058 -3.796267 0.394486
C  2.98624 -4.231042 0.044192
H  3.097327 -5.194562 0.553725
H  3.094787 -4.435582 -1.028137
C  1.5923 -3.671635 0.320764
H  1.451606 -2.724066 -0.203469
H  1.502487 -3.433244 1.386268
C  0.452852 -4.602457 -0.083892
H  0.52819 -4.824552 -1.155874
H  0.547538 -5.563099 0.43879
C  -0.907729 -3.976866 0.211559
H  -0.946181 -2.989571 -0.252859
H  -0.996186 -3.799205 1.289345
C  -2.091346 -4.811662 -0.267304
H  -1.99449 -5.837764 0.10911
H  -2.061217 -4.878918 -1.361797
C  -3.444442 -4.23882 0.163927
H  -4.246149 -4.871839 -0.23631
H  -3.525614 -4.294153 1.256436
C  -3.66965 -2.794375 -0.279208
H  -2.971121 -2.127541 0.230542
H  -3.452389 -2.696506 -1.34941
C  -5.091303 -2.30347 -0.009462
H  -5.319536 -2.425462 1.055254
H  -5.805062 -2.938906 -0.548732
N  -5.353507 -0.910972 -0.365634
H  -4.75153 -0.302811 0.179092
H  -5.089643 -0.750226 -1.330923
totalener: -2082.86863387819039 hartree
nucrepener: 4829.64289485688823 hartree
electener: -6912.51153638046435 hartree
twoeener: 5611.66907123758847 hartree
kineticenergy: 2074.83013642064361 hartree
exchangeener: -174.225063545515 hartree
correlationener: -12.204460628778 hartree
xcener: -186.429524174293 hartree
energy: -671.2541 -671.2303 -670.8563 -670.0730 -669.9084 -669.9036 -669.8810 -669.8292 -669.7786 -669.7130 -669.6250 -669.5806 -393.6157 -388.3593 -280.3620 -278.8306 -278.1487 -277.9348 -277.5861 -277.1471 -277.0625 -277.0564 -276.8940 -276.8092 -276.6470 -276.3199 -184.3849 -184.3780 -184.3140 -184.1037 -184.0306 -184.0184 -183.9998 -183.9717 -183.9261 -183.8957 -183.8425 -183.8269 -33.5571 -33.4426 -33.1088 -32.4427 -32.3032 -32.2557 -32.2256 -32.1788 -32.1084 -32.0722 -31.9721 -31.9169 -29.5108 -24.7497 -24.6035 -23.7432 -23.1548 -22.3384 -22.3341 -21.3765 -20.4326 -19.4082 -18.7284 -18.1436 -18.0974 -18.0694 -17.9028 -17.5708 -17.4828 -17.1034 -16.9887 -16.1979 -15.9462 -15.2915 -15.1445 -14.9999 -14.8369 -14.7539 -14.6962 -14.3717 -14.2873 -13.9714 -13.8509 -13.8050 -13.7452 -13.5720 -13.4447 -13.3410 -13.2862 -13.2505 -13.1217 -13.0740 -13.0340 -13.0161 -12.8357 -12.8167 -12.7006 -12.6266 -12.6112 -12.4966 -12.4874 -12.4402 -12.3367 -12.1515 -12.0722 -11.9808 -11.8795 -11.7862 -11.6464 -11.5171 -11.4077 -11.2591 -11.2421 -11.1927 -11.1612 -11.0876 -11.0564 -11.0482 -11.0159 -10.9845 -10.7908 -10.7392 -10.6978 -10.6082 -10.5414 -10.3820 -10.0427 -9.8291 -9.7348 -9.4423 -9.3225 -9.3108 -9.2115 -9.1962 -9.0966 -9.0817 -8.9532 -8.8423 -8.6454 -6.3787 -6.1642 -6.1182 -6.1048 -5.9869 3.3056 3.8155 4.5257 4.6093 4.9801 5.2166 5.3106 5.5471 5.6526 5.7649 5.8605 electronvolt
chargesum: -1.0000000
charge: -0.120027 0.121126 0.122113 0.226378 0.219946 0.230337 -0.059247 0.191638 0.215686 0.214052 0.220390 0.211337 0.186042 0.231499 0.247606 0.194222 0.242165 -0.340948 -0.374532 -0.339733 -0.342337 -0.344478 -0.359970 -0.374741 -0.394938 -0.373144 -0.405472 -0.345853 -0.340114 0.192058 0.222591 -0.152934 0.074500 0.095627 -0.058925 0.027569 0.069647 -0.155885 0.069821 0.062094 -0.130275 0.060127 0.050859 -0.041726 0.041402 0.069006 -0.167278 0.046680 0.039691 -0.032003 0.040246 0.062081 -0.118022 0.043563 0.049529 -0.140368 0.045032 0.051216 -0.056884 0.047706 0.049090 -0.030515 0.048271 0.039845 -0.361589 0.162814 0.126341
charge: -0.003844 0.022376 0.020355 0.001450 0.026305 0.001631 0.604148 -0.438980 -0.438608 -0.435332 -0.433248 -0.435008 -0.436779 -0.437850 -0.450600 -0.435751 -0.422933 0.304426 0.300376 0.306449 0.302687 0.296509 0.302026 0.284759 0.286210 0.301851 0.256661 0.296470 0.302307 -0.453478 -0.434082 -0.029228 0.024436 0.027161 -0.027482 0.017692 0.018624 -0.028346 0.020662 0.010856 -0.030644 0.013822 0.014759 -0.029406 0.022561 0.021956 -0.031505 0.014042 0.009261 -0.028662 0.027478 0.021101 -0.035957 0.008456 0.013654 -0.035190 0.009730 0.014083 -0.041715 0.024316 0.014924 -0.104455 0.009624 0.002627 0.215989 -0.054032 -0.061699
qa: -0.1200 0.1211 0.1221 0.2264 0.2199 0.2303 -0.0592 0.1916 0.2157 0.2141 0.2204 0.2113 0.1860 0.2315 0.2476 0.1942 0.2422 -0.3409 -0.3745 -0.3397 -0.3423 -0.3445 -0.3600 -0.3747 -0.3949 -0.3731 -0.4055 -0.3459 -0.3401 0.1921 0.2226 -0.1529 0.0745 0.0956 -0.0589 0.0276 0.0696 -0.1559 0.0698 0.0621 -0.1303 0.0601 0.0509 -0.0417 0.0414 0.0690 -0.1673 0.0467 0.0397 -0.0320 0.0402 0.0621 -0.1180 0.0436 0.0495 -0.1404 0.0450 0.0512 -0.0569 0.0477 0.0491 -0.0305 0.0483 0.0398 -0.3616 0.1628 0.1263
va: 3.8778 0.9958 0.9988 1.0458 0.9990 1.0353 3.5851 3.5254 3.5983 3.5247 3.5190 3.2946 3.8151 3.3495 3.3997 3.5792 3.3830 1.0872 1.0304 1.0916 1.0882 1.0846 1.0545 1.0106 0.9784 1.0361 0.9710 1.0803 1.0940 3.3257 3.4125 3.8494 1.0143 1.0096 3.8335 1.0699 1.0114 3.9580 1.0068 1.0074 3.9171 1.0099 1.0071 3.8809 1.0289 1.0121 3.9362 1.0053 1.0093 3.8851 1.0413 1.0105 3.9068 1.0088 1.0052 3.9309 1.0110 1.0066 3.8196 1.0362 1.0170 4.0147 0.9981 0.9996 3.0624 1.0484 1.0333
dispcorr: -0.175833952 hartree
energy: -2083.047188062743
temp: 298.15 k
press: 1.00 atm
zeropoint: 0.50958467 hartree
thermalvibcorrection: 0.03701356 hartree
thermalrotcorrection: 0.00141627 hartree
thermaltrasncorrection: 0.00141627 hartree
thermaltotal: -2082.49775729 hartree
thermalcorr: 0.03984610 hartree
nonthermalcorr: 0.50958467 hartree
totalcorr: 0.54943078 hartree
thermalcorrenthalpy: 0.00094421 hartree
totalenthalpy: -2082.49681308 hartree
totalentropycorr: -0.10559575 hartree
gibbsenthalpy: -2082.60240883 hartree
gibbsminuselec: 0.44477924 hartree
