program: Orca
programVersion: 6.0.0
elementType: C H H C H H C H H C H H C H H C H H C H H C H H C H H C H H C H H H H H N B B B B B B B B B B F F F F F F F F F F F F B B N H H H
charge: 0
multiplicity: 1
keywords: opt freq wB97x-D3BJ def2-TZVPP TightSCF defgrid3 RIJCOSX
keywords: PAL8
frequency: 0.00 0.00 0.00 0.00 0.00 0.00 17.98 28.08 35.04 49.63 66.55 74.25 81.01 95.46 99.92 106.67 111.50 127.78 136.60 144.48 149.28 161.05 169.62 170.24 171.20 171.27 172.63 172.88 175.82 180.10 181.65 183.40 185.67 186.38 189.39 191.06 194.10 214.70 218.49 222.32 237.63 243.99 246.82 258.93 265.13 282.41 302.38 311.10 313.23 339.99 351.30 400.79 401.31 402.38 402.95 405.51 415.04 422.88 439.04 449.53 485.16 485.95 487.24 490.29 512.91 556.77 562.37 564.71 671.49 672.52 676.69 679.12 682.25 730.78 739.28 744.51 748.15 749.04 754.21 793.61 796.18 799.31 809.65 813.26 822.03 824.87 825.75 830.03 833.78 841.11 842.21 843.54 845.15 846.91 853.89 859.07 882.48 923.84 944.65 961.59 973.19 989.23 1006.83 1028.04 1037.85 1051.85 1074.40 1077.38 1090.12 1098.14 1115.58 1119.26 1121.17 1142.85 1161.81 1169.76 1180.94 1184.26 1197.61 1199.05 1207.80 1215.10 1243.28 1244.02 1247.08 1249.75 1269.26 1275.08 1277.24 1284.69 1296.53 1297.74 1303.79 1331.88 1333.85 1339.15 1346.25 1351.21 1352.51 1355.42 1360.78 1369.39 1372.90 1394.63 1411.09 1416.25 1428.18 1433.41 1438.73 1446.39 1497.10 1499.32 1501.12 1503.69 1507.27 1509.59 1513.00 1518.94 1519.72 1522.00 1526.22 1561.94 1600.42 1635.51 1672.06 1693.77 1710.40 3037.39 3043.20 3046.81 3050.11 3053.54 3054.77 3057.08 3059.89 3065.24 3075.48 3088.76 3091.45 3098.20 3101.67 3104.56 3104.67 3112.78 3116.18 3122.77 3142.09 3146.70 3160.82 3177.76 3291.59 3365.44 3469.17 3513.45 3571.20
frequency: 17.98 28.08 35.04 49.63 66.55 74.25 81.01 95.46 99.92 106.67 111.50 127.78 136.60 144.48 149.28 161.05 169.62 170.24 171.20 171.27 172.63 172.88 175.82 180.10 181.65 183.40 185.67 186.38 189.39 191.06 194.10 214.70 218.49 222.32 237.63 243.99 246.82 258.93 265.13 282.41 302.38 311.10 313.23 339.99 351.30 400.79 401.31 402.38 402.95 405.51 415.04 422.88 439.04 449.53 485.16 485.95 487.24 490.29 512.91 556.77 562.37 564.71 671.49 672.52 676.69 679.12 682.25 730.78 739.28 744.51 748.15 749.04 754.21 793.61 796.18 799.31 809.65 813.26 822.03 824.87 825.75 830.03 833.78 841.11 842.21 843.54 845.15 846.91 853.89 859.07 882.48 923.84 944.65 961.59 973.19 989.23 1006.83 1028.04 1037.85 1051.85 1074.40 1077.38 1090.12 1098.14 1115.58 1119.26 1121.17 1142.85 1161.81 1169.76 1180.94 1184.26 1197.61 1199.05 1207.80 1215.10 1243.28 1244.02 1247.08 1249.75 1269.26 1275.08 1277.24 1284.69 1296.53 1297.74 1303.79 1331.88 1333.85 1339.15 1346.25 1351.21 1352.51 1355.42 1360.78 1369.39 1372.90 1394.63 1411.09 1416.25 1428.18 1433.41 1438.73 1446.39 1497.10 1499.32 1501.12 1503.69 1507.27 1509.59 1513.00 1518.94 1519.72 1522.00 1526.22 1561.94 1600.42 1635.51 1672.06 1693.77 1710.40 3037.39 3043.20 3046.81 3050.11 3053.54 3054.77 3057.08 3059.89 3065.24 3075.48 3088.76 3091.45 3098.20 3101.67 3104.56 3104.67 3112.78 3116.18 3122.77 3142.09 3146.70 3160.82 3177.76 3291.59 3365.44 3469.17 3513.45 3571.20
formula: C11H28B12F12N2
InChI: InChI=1/C11H28N2.B12F12/c12-10-8-6-4-2-1-3-5-7-9-11-13;13-1-2(14)3(1,15)5(1,17)6(1,18)4(1,2,16)8(2,20)7(2,3,19)9(3,5,21)11(5,6,23)10(4,6,8,22)12(7,8,9,11)24/h1-11H2,12-13H3;
65 atoms
C  -1.120217 3.317226 -0.501773
H  -0.273035 3.97569 -0.700247
H  -1.621643 3.091275 -1.441333
C  -0.7007 2.036573 0.198474
H  -1.552931 1.355976 0.20571
H  -0.434302 2.237751 1.241932
C  0.491675 1.390398 -0.518189
H  1.415384 1.868859 -0.178713
H  0.421719 1.583075 -1.59423
C  0.556417 -0.124016 -0.301077
H  0.404052 -0.340047 0.762043
H  1.564999 -0.471107 -0.536981
C  -0.475889 -0.895178 -1.151276
H  0.047702 -1.547643 -1.856627
H  -1.049551 -0.192355 -1.761372
C  -1.464751 -1.734766 -0.346411
H  -2.035908 -1.082022 0.323063
H  -0.918965 -2.439117 0.29269
C  -2.43563 -2.501366 -1.241517
H  -1.87491 -3.192987 -1.881351
H  -2.94065 -1.795309 -1.908676
C  -3.482335 -3.273382 -0.445484
H  -4.042786 -2.555057 0.159741
H  -2.9872 -3.943171 0.267089
C  -4.423172 -4.106187 -1.321008
H  -3.842484 -4.898599 -1.798461
H  -4.808968 -3.492128 -2.143425
C  -5.586034 -4.734154 -0.530525
H  -5.299495 -4.837361 0.521141
H  -5.798631 -5.743669 -0.888593
C  -6.897966 -3.96405 -0.622791
H  -7.639982 -4.35232 0.07472
H  -7.312663 -4.014797 -1.630112
H  -6.179018 -2.048776 -1.0780
H  -7.581669 -1.975882 -0.262347
H  -6.195605 -2.336768 0.536956
N  -6.708831 -2.516403 -0.326066
B  -7.299904 1.561904 -2.070506
B  -6.672719 1.83848 0.764889
B  -6.283133 3.387646 -0.050333
B  -6.676967 3.220187 -1.800713
B  -5.601234 0.586166 0.063609
B  -5.59857 1.953099 -2.493873
B  -4.992645 3.066447 -1.242778
B  -4.991868 2.215527 0.320721
B  -7.725971 2.454745 -0.559318
B  -5.98051 0.424354 -1.668952
F  -6.325764 4.597071 0.605828
F  -4.019417 4.038486 -1.52732
F  -7.082396 4.295942 -2.545724
F  -9.005719 2.875976 -0.314314
F  -7.07783 1.755007 2.074696
F  -3.994409 2.477366 1.292776
F  -5.843412 -0.838462 -2.284557
F  -5.170213 -0.516499 0.81555
F  -3.253041 0.913943 -1.388139
F  -8.218266 -0.279168 -0.18677
F  -8.236915 1.247836 -3.021962
F  -5.135145 1.991431 -3.785437
B  -4.555851 1.345101 -1.167843
B  -7.285492 0.729081 -0.490354
N  -2.104908 4.102715 0.318179
H  -1.649866 4.60811 1.073191
H  -2.626317 4.750368 -0.276108
H  -2.830709 3.484636 0.733871
totalener: -2044.00819778747655 hartree
nucrepener: 4661.24893336212244 hartree
electener: -6705.25712125738755 hartree
twoeener: 5400.85431653832893 hartree
kineticenergy: 2036.07801622855914 hartree
exchangeener: -170.430895843604 hartree
correlationener: -11.889981312771 hartree
xcener: -182.320877156374 hartree
energy: -673.8675 -673.6304 -673.4786 -673.3859 -673.3485 -673.1433 -672.4560 -672.4333 -672.3805 -672.2672 -672.1330 -672.1324 -396.2299 -395.8526 -282.2855 -282.1662 -280.8110 -280.5210 -280.2971 -280.1789 -279.9215 -279.8080 -279.5646 -279.5308 -279.5123 -187.0454 -187.0339 -186.9941 -186.9570 -186.8918 -186.8662 -186.7452 -186.6915 -186.6611 -186.6106 -186.5436 -186.5203 -36.1576 -35.9432 -35.7671 -35.6599 -35.6558 -35.4674 -34.8654 -34.7883 -34.7783 -34.6626 -34.5401 -34.4951 -31.8900 -31.6890 -26.7607 -26.6412 -25.8262 -25.1009 -25.0642 -24.1277 -22.9926 -22.0213 -21.1890 -20.9089 -20.8506 -20.8102 -20.5106 -20.4494 -20.0065 -19.8156 -19.5761 -19.4900 -19.3560 -17.9502 -17.9036 -17.8001 -17.7324 -17.7030 -17.5724 -17.5078 -17.1502 -17.0829 -16.7966 -16.6821 -16.5165 -16.4376 -16.3343 -16.2391 -16.0996 -16.0014 -15.8725 -15.8035 -15.7381 -15.7003 -15.6202 -15.5167 -15.5063 -15.3695 -15.3389 -15.3139 -15.1658 -15.1516 -15.0538 -14.9176 -14.7584 -14.6755 -14.6340 -14.6094 -14.4776 -14.3918 -14.2955 -14.2270 -14.1347 -14.0476 -13.9739 -13.7390 -13.6932 -13.6561 -13.5906 -13.5295 -13.4815 -13.3912 -13.3845 -13.2686 -12.9792 -12.9343 -12.7158 -12.4454 -12.1582 -12.0504 -12.0106 -11.9623 -11.9221 -11.8332 -11.8231 -11.6900 -11.4231 -8.9325 -8.9156 -8.8247 -8.6898 0.6571 1.3353 1.8839 2.5171 2.5769 2.7558 2.7943 2.9514 3.1618 3.2169 3.4553 electronvolt
chargesum: 0.0000000
charge: -0.146413 0.139718 0.156620 -0.115760 0.088866 0.084985 -0.162843 0.080584 0.083045 -0.168157 0.070361 0.089508 -0.133417 0.082942 0.078154 -0.130378 0.068619 0.074603 -0.139240 0.073132 0.077860 -0.139359 0.048330 0.084025 -0.146749 0.093270 0.083464 -0.177977 0.093612 0.104560 -0.129933 0.130428 0.141080 0.225939 0.238802 0.212988 -0.042704 0.197481 0.214717 0.177446 0.220551 0.231997 0.175894 0.271046 0.199590 0.209916 0.222900 -0.331608 -0.416165 -0.322953 -0.323243 -0.327137 -0.354703 -0.371333 -0.406818 -0.421189 -0.380468 -0.326043 -0.325283 0.270778 0.233889 -0.071939 0.209647 0.232260 0.238205
charge: 0.013968 0.021758 0.035875 -0.027086 0.027306 0.017181 -0.022306 0.015400 0.023529 -0.018339 0.020169 0.015128 -0.024904 0.015349 0.020428 -0.034177 0.018998 0.014660 -0.024783 0.017502 0.026076 -0.037377 0.010918 0.018798 -0.024059 0.021884 0.021273 -0.022783 0.024761 0.028204 0.004442 0.023757 0.030256 0.006753 0.017349 0.031834 0.608237 -0.436679 -0.440183 -0.438268 -0.435060 -0.450837 -0.438393 -0.433553 -0.421383 -0.434752 -0.428208 0.308947 0.277061 0.324844 0.325735 0.315575 0.313021 0.297302 0.274954 0.298110 0.292582 0.320047 0.317769 -0.459203 -0.425379 0.604629 0.033441 0.032338 -0.010433
qa: -0.1464 0.1397 0.1566 -0.1158 0.0889 0.0850 -0.1628 0.0806 0.0830 -0.1682 0.0704 0.0895 -0.1334 0.0829 0.0782 -0.1304 0.0686 0.0746 -0.1392 0.0731 0.0779 -0.1394 0.0483 0.0840 -0.1467 0.0933 0.0835 -0.1780 0.0936 0.1046 -0.1299 0.1304 0.1411 0.2259 0.2388 0.2130 -0.0427 0.1975 0.2147 0.1774 0.2206 0.2320 0.1759 0.2710 0.1996 0.2099 0.2229 -0.3316 -0.4162 -0.3230 -0.3232 -0.3271 -0.3547 -0.3713 -0.4068 -0.4212 -0.3805 -0.3260 -0.3253 0.2708 0.2339 -0.0719 0.2096 0.2323 0.2382
va: 3.8241 0.9992 0.9969 3.8122 1.0331 1.0092 3.9385 1.0073 1.0034 3.9037 1.0071 1.0033 3.8692 1.0043 1.0118 3.8872 1.0104 1.0101 3.8813 1.0097 1.0219 3.8447 1.0288 1.0136 3.8196 1.0058 1.0181 3.8655 1.0055 1.0107 3.8768 0.9987 0.9929 1.0528 1.0113 0.9980 3.6025 3.5965 3.6317 3.6113 3.6018 3.4424 3.7654 3.3283 3.4644 3.5904 3.4078 1.0999 0.9600 1.1180 1.1177 1.1093 1.0418 1.0199 0.9665 0.9639 1.0095 1.1109 1.1129 3.1350 3.4537 3.6227 0.9826 0.9920 1.0634
dispcorr: -0.175686068 hartree
energy: -2044.190939783675
temp: 298.15 k
press: 1.00 atm
zeropoint: 0.49719289 hartree
thermalvibcorrection: 0.03519271 hartree
thermalrotcorrection: 0.00141627 hartree
thermaltrasncorrection: 0.00141627 hartree
thermaltotal: -2043.65572164 hartree
thermalcorr: 0.03802525 hartree
nonthermalcorr: 0.49719289 hartree
totalcorr: 0.53521814 hartree
thermalcorrenthalpy: 0.00094421 hartree
totalenthalpy: -2043.65477743 hartree
totalentropycorr: -0.10165041 hartree
gibbsenthalpy: -2043.75642785 hartree
gibbsminuselec: 0.43451194 hartree
