program: Orca
programVersion: 6.0.0
elementType: B B B B B B B B B B F F F F F F F F F F F F B B C H H C H H C H H C H H C H H C H H C H H C H H C H H C H H N H H H N H H
charge: -1
multiplicity: 1
keywords: opt freq wB97x-D3BJ def2-TZVPP TightSCF defgrid3 RIJCOSX
keywords: PAL8
frequency: 0.00 0.00 0.00 0.00 0.00 0.00 17.21 29.39 35.52 56.87 68.08 74.87 95.26 105.24 113.15 122.99 136.93 166.62 170.71 171.08 171.33 173.05 173.85 174.71 175.26 177.49 181.34 182.27 186.17 186.44 187.25 188.39 188.96 189.96 199.52 205.72 210.04 215.71 218.34 231.41 236.04 240.33 246.48 248.83 285.87 297.92 333.03 345.95 377.05 397.77 399.80 400.62 400.91 403.03 409.02 436.51 463.33 480.50 485.60 487.15 489.00 516.78 543.38 557.54 563.78 564.23 672.05 675.60 676.81 679.29 680.26 737.68 745.41 748.60 751.05 756.90 765.01 802.85 804.03 808.08 808.74 811.46 812.15 818.71 821.26 830.36 831.80 834.11 840.46 845.94 854.11 856.54 859.50 893.03 936.73 938.93 964.33 974.91 988.83 1023.78 1040.88 1056.50 1069.42 1084.82 1093.80 1107.20 1115.01 1124.29 1131.29 1137.72 1167.67 1176.04 1178.94 1190.92 1200.37 1220.67 1225.14 1229.85 1233.84 1237.19 1237.94 1247.71 1267.52 1270.23 1281.19 1282.59 1285.89 1318.03 1319.70 1332.45 1341.92 1345.20 1347.52 1354.14 1356.29 1367.09 1381.58 1392.72 1396.28 1407.16 1421.76 1433.90 1443.73 1452.45 1492.56 1496.56 1499.92 1500.94 1504.80 1511.43 1511.78 1518.56 1520.36 1533.26 1576.82 1658.13 1689.73 1700.40 2810.81 3025.09 3030.83 3032.72 3041.72 3049.11 3049.72 3056.44 3058.73 3067.35 3070.25 3088.10 3091.81 3094.69 3101.50 3108.96 3114.48 3125.76 3134.31 3138.18 3230.55 3394.08 3520.87 3555.79 3583.52
frequency: 17.21 29.39 35.52 56.87 68.08 74.87 95.26 105.24 113.15 122.99 136.93 166.62 170.71 171.08 171.33 173.05 173.85 174.71 175.26 177.49 181.34 182.27 186.17 186.44 187.25 188.39 188.96 189.96 199.52 205.72 210.04 215.71 218.34 231.41 236.04 240.33 246.48 248.83 285.87 297.92 333.03 345.95 377.05 397.77 399.80 400.62 400.91 403.03 409.02 436.51 463.33 480.50 485.60 487.15 489.00 516.78 543.38 557.54 563.78 564.23 672.05 675.60 676.81 679.29 680.26 737.68 745.41 748.60 751.05 756.90 765.01 802.85 804.03 808.08 808.74 811.46 812.15 818.71 821.26 830.36 831.80 834.11 840.46 845.94 854.11 856.54 859.50 893.03 936.73 938.93 964.33 974.91 988.83 1023.78 1040.88 1056.50 1069.42 1084.82 1093.80 1107.20 1115.01 1124.29 1131.29 1137.72 1167.67 1176.04 1178.94 1190.92 1200.37 1220.67 1225.14 1229.85 1233.84 1237.19 1237.94 1247.71 1267.52 1270.23 1281.19 1282.59 1285.89 1318.03 1319.70 1332.45 1341.92 1345.20 1347.52 1354.14 1356.29 1367.09 1381.58 1392.72 1396.28 1407.16 1421.76 1433.90 1443.73 1452.45 1492.56 1496.56 1499.92 1500.94 1504.80 1511.43 1511.78 1518.56 1520.36 1533.26 1576.82 1658.13 1689.73 1700.40 2810.81 3025.09 3030.83 3032.72 3041.72 3049.11 3049.72 3056.44 3058.73 3067.35 3070.25 3088.10 3091.81 3094.69 3101.50 3108.96 3114.48 3125.76 3134.31 3138.18 3230.55 3394.08 3520.87 3555.79 3583.52
formula: C10H25B12F12N2
InChI: InChI=1/C10H25N2.B12F12/c11-9-7-5-3-1-2-4-6-8-10-12;13-1-2(14)3(1,15)5(1,17)6(1,18)4(1,2,16)8(2,20)7(2,3,19)9(3,5,21)11(5,6,23)10(4,6,8,22)12(7,8,9,11)24/h1-11H2,12H3;
61 atoms
B  -2.853553 -1.609459 0.315024
B  -1.545277 0.744158 1.416994
B  -3.047899 1.283972 0.604727
B  -3.857561 -0.169811 -0.0753
B  -0.499158 0.039287 0.177794
B  -2.788019 -0.873952 -1.322254
B  -2.908418 0.911429 -1.14501
B  -1.474537 1.466859 -0.222882
B  -3.016025 -0.272479 1.507286
B  -1.291271 -1.390666 -0.504849
F  -3.765906 2.371316 1.055636
F  -3.488285 1.698098 -2.119903
F  -5.230351 -0.25432 -0.168192
F  -3.712128 -0.438825 2.685545
F  -1.000603 1.395634 2.507918
F  -0.84034 2.684416 -0.472053
F  -0.472563 -2.421766 -1.021468
F  0.902535 0.10576 0.26845
F  -0.590374 0.264053 -2.589559
F  -0.775793 -1.824487 2.176127
F  -3.406347 -2.855442 0.526281
F  -3.249698 -1.530506 -2.447038
B  -1.331157 0.141156 -1.396689
B  -1.424357 -1.041545 1.237861
C  2.656928 -1.877361 -1.142117
H  2.354571 -2.923353 -1.197358
H  2.407617 -1.512826 -0.152858
C  4.127757 -1.700948 -1.486967
H  4.32958 -2.225966 -2.427569
H  4.333023 -0.641301 -1.669189
C  5.081024 -2.214751 -0.395032
H  4.673155 -3.126242 0.056574
H  6.015506 -2.508904 -0.880427
C  5.407874 -1.181954 0.692626
H  5.572613 -0.217115 0.20696
H  6.36609 -1.447372 1.151307
C  4.37824 -1.023993 1.821596
H  3.35713 -1.115148 1.450069
H  4.509501 -1.85215 2.524139
C  4.497208 0.321659 2.555349
H  4.27436 0.182606 3.616486
H  5.535588 0.672209 2.502244
C  3.551467 1.398603 2.009632
H  3.724679 2.33479 2.552001
H  2.519155 1.10418 2.221769
C  3.668842 1.657752 0.509881
H  4.705377 1.908203 0.248453
H  3.416403 0.745587 -0.032538
C  2.748281 2.774655 0.029364
H  1.741756 2.626621 0.429948
H  3.103202 3.732883 0.42257
C  2.66022 2.87391 -1.490462
H  2.234156 3.84698 -1.760642
H  3.663869 2.823468 -1.927818
N  1.788308 -1.107402 -2.073487
H  1.985432 -1.33124 -3.045084
H  0.806858 -1.351332 -1.898933
H  1.89361 -0.059453 -1.956469
N  1.847677 1.7792 -2.056511
H  0.921227 1.843204 -1.643043
H  1.693626 1.956705 -3.043269
totalener: -2004.17155498268744 hartree
nucrepener: 4474.66839614311903 hartree
electener: -6478.83994667548723 hartree
twoeener: 5230.98747835943686 hartree
kineticenergy: 1996.50574904435052 hartree
exchangeener: -166.469253139558 hartree
correlationener: -11.569794114137 hartree
xcener: -178.039047253695 hartree
energy: -670.6289 -670.5293 -670.5135 -670.0201 -669.6520 -669.5935 -669.5745 -669.5178 -669.4658 -669.3744 -669.3287 -669.3114 -393.1949 -390.1926 -279.5352 -278.6463 -278.4049 -278.3524 -277.9708 -277.6675 -277.5646 -277.4162 -277.3314 -277.2938 -183.9476 -183.9337 -183.9131 -183.8246 -183.7200 -183.6964 -183.6676 -183.6659 -183.6550 -183.5779 -183.5346 -183.5150 -32.9509 -32.8096 -32.7581 -32.3114 -32.0127 -31.9638 -31.9026 -31.8586 -31.8177 -31.7378 -31.6606 -31.6310 -28.9909 -26.1922 -24.6748 -23.8342 -22.9869 -22.0090 -21.9915 -20.9507 -19.8820 -19.0137 -18.0558 -17.7876 -17.7470 -17.7224 -17.5182 -17.2865 -17.0440 -16.7735 -15.2614 -15.1418 -14.8419 -14.7594 -14.6870 -14.6540 -14.4964 -14.4493 -14.1741 -14.0380 -13.9862 -13.5928 -13.5066 -13.4523 -13.3649 -13.3047 -13.2150 -12.9893 -12.8816 -12.8661 -12.7659 -12.7551 -12.6762 -12.5519 -12.4438 -12.3487 -12.2886 -12.2439 -12.1890 -12.1739 -12.1475 -12.0931 -11.9329 -11.6740 -11.6347 -11.5922 -11.4671 -11.3576 -11.2785 -11.2290 -11.0966 -11.0668 -10.9121 -10.8257 -10.7638 -10.7440 -10.7142 -10.7014 -10.6140 -10.4700 -10.4330 -10.4098 -10.4071 -10.1850 -10.0649 -9.6557 -9.4562 -9.3536 -8.9145 -8.9012 -8.8651 -8.8210 -8.7644 -8.2902 -5.8235 -5.7826 -5.7601 -5.7123 3.5495 3.9517 4.3995 4.5021 4.9052 5.1675 5.2550 5.5380 5.6680 5.9130 6.0100 electronvolt
chargesum: -1.0000000
charge: 0.230052 0.169473 0.222225 0.223118 0.394557 0.179534 0.199003 0.160027 0.218215 0.171365 -0.345276 -0.347171 -0.346726 -0.344924 -0.351582 -0.369958 -0.387733 -0.462145 -0.392066 -0.351159 -0.346462 -0.348468 0.225685 0.141787 -0.109215 0.133529 0.131187 -0.132312 0.083813 0.074824 -0.151266 0.073392 0.081108 -0.154621 0.063488 0.078347 -0.116824 0.071404 0.077380 -0.149878 0.081010 0.047099 -0.146015 0.059268 0.095849 0.008030 0.055609 -0.036110 -0.144474 0.095688 0.065994 -0.054160 0.096677 0.053888 -0.039594 0.179624 0.238165 0.176791 -0.370296 0.192618 0.148610
charge: -0.433214 -0.438942 -0.432682 -0.433630 -0.473877 -0.439041 -0.436122 -0.444153 -0.432778 -0.433778 0.299585 0.295986 0.301204 0.300613 0.292538 0.275969 0.265433 0.276534 0.253321 0.289451 0.297407 0.293333 -0.458482 -0.438170 0.000241 0.024165 0.016500 -0.034490 0.013279 0.019879 -0.017990 0.021900 0.015324 -0.032400 0.014965 0.014456 -0.020490 0.017302 0.013151 -0.024672 0.015441 0.012320 -0.024351 0.014888 0.031419 -0.041432 0.007980 0.010923 -0.026286 0.033730 0.016120 -0.075319 0.005743 0.004541 0.593006 0.025012 0.024120 -0.019999 0.289507 -0.029044 -0.055949
qa: 0.2301 0.1695 0.2222 0.2231 0.3946 0.1795 0.1990 0.1600 0.2182 0.1714 -0.3453 -0.3472 -0.3467 -0.3449 -0.3516 -0.3700 -0.3877 -0.4621 -0.3921 -0.3512 -0.3465 -0.3485 0.2257 0.1418 -0.1092 0.1335 0.1312 -0.1323 0.0838 0.0748 -0.1513 0.0734 0.0811 -0.1546 0.0635 0.0783 -0.1168 0.0714 0.0774 -0.1499 0.0810 0.0471 -0.1460 0.0593 0.0958 0.0080 0.0556 -0.0361 -0.1445 0.0957 0.0660 -0.0542 0.0967 0.0539 -0.0396 0.1796 0.2382 0.1768 -0.3703 0.1926 0.1486
va: 3.5222 3.4979 3.5371 3.4607 2.8538 3.5712 3.5434 3.3984 3.4628 3.3646 1.0843 1.0797 1.0810 1.0830 1.0680 1.0268 0.9950 0.8882 0.9843 1.0697 1.0814 1.0765 3.3420 3.5694 3.8328 1.0035 1.0173 3.8704 1.0022 1.0140 3.9491 1.0079 0.9987 3.9058 1.0043 1.0022 3.8730 1.0281 1.0055 3.9039 1.0030 1.0058 3.9531 1.0086 1.0184 3.8235 1.0061 1.0217 3.9099 1.0341 1.0127 3.9198 0.9903 1.0008 3.5764 1.0005 1.0225 1.1364 3.0864 1.0291 1.0133
dispcorr: -0.170163091 hartree
energy: -2004.342841385976
temp: 298.15 k
press: 1.00 atm
zeropoint: 0.45389764 hartree
thermalvibcorrection: 0.03344751 hartree
thermalrotcorrection: 0.00141627 hartree
thermaltrasncorrection: 0.00141627 hartree
thermaltotal: -2003.85266368 hartree
thermalcorr: 0.03628006 hartree
nonthermalcorr: 0.45389764 hartree
totalcorr: 0.49017770 hartree
thermalcorrenthalpy: 0.00094421 hartree
totalenthalpy: -2003.85171948 hartree
totalentropycorr: -0.09804650 hartree
gibbsenthalpy: -2003.94976597 hartree
gibbsminuselec: 0.39307541 hartree
