program: Orca
programVersion: 6.0.0
elementType: C H H C H H C H H C H H C H H C H H C H H C H H C H H H H H N B B B B B B B B B B F F F F F F F F F F F F B B N H H H
charge: 0
multiplicity: 1
keywords: opt freq wB97x-D3BJ def2-TZVPP TightSCF defgrid3 RIJCOSX
keywords: PAL8
frequency: 0.00 0.00 0.00 0.00 0.00 0.00 32.99 45.68 49.91 66.13 75.33 92.23 98.46 99.92 129.54 135.14 141.84 148.57 155.00 165.64 169.63 170.49 171.89 172.31 174.26 177.17 181.95 184.31 185.16 186.65 188.46 193.86 198.48 203.38 209.29 215.35 217.17 234.09 235.14 244.50 252.20 259.91 278.19 286.85 295.92 314.91 329.09 344.35 396.31 400.30 400.47 402.21 403.17 404.03 432.59 437.72 486.19 486.58 488.43 502.62 534.39 557.30 562.64 564.73 670.51 672.64 677.73 679.33 682.38 735.67 745.11 747.05 750.12 759.19 764.80 795.88 800.24 801.24 804.25 810.24 819.71 823.35 831.18 836.88 839.28 843.64 844.27 844.64 853.25 855.76 881.36 910.06 932.64 952.86 966.25 969.18 1008.48 1034.21 1045.39 1054.11 1088.26 1089.54 1100.19 1113.51 1121.70 1139.80 1162.77 1168.90 1179.31 1189.29 1194.88 1207.78 1216.49 1231.25 1240.10 1247.74 1248.40 1260.69 1279.35 1279.95 1283.96 1296.90 1304.92 1324.04 1335.59 1347.44 1349.63 1353.28 1355.01 1362.19 1372.23 1375.44 1396.54 1408.72 1421.26 1437.19 1444.70 1456.23 1492.70 1495.76 1501.04 1505.33 1508.40 1510.18 1517.16 1519.85 1525.44 1561.00 1589.36 1646.56 1667.93 1692.74 1702.17 3044.28 3045.73 3050.13 3050.95 3059.90 3075.67 3081.15 3084.46 3087.94 3089.76 3094.99 3103.10 3103.55 3120.03 3125.47 3142.40 3160.69 3163.84 3225.15 3237.10 3409.89 3417.11 3553.84 3566.15
frequency: 32.99 45.68 49.91 66.13 75.33 92.23 98.46 99.92 129.54 135.14 141.84 148.57 155.00 165.64 169.63 170.49 171.89 172.31 174.26 177.17 181.95 184.31 185.16 186.65 188.46 193.86 198.48 203.38 209.29 215.35 217.17 234.09 235.14 244.50 252.20 259.91 278.19 286.85 295.92 314.91 329.09 344.35 396.31 400.30 400.47 402.21 403.17 404.03 432.59 437.72 486.19 486.58 488.43 502.62 534.39 557.30 562.64 564.73 670.51 672.64 677.73 679.33 682.38 735.67 745.11 747.05 750.12 759.19 764.80 795.88 800.24 801.24 804.25 810.24 819.71 823.35 831.18 836.88 839.28 843.64 844.27 844.64 853.25 855.76 881.36 910.06 932.64 952.86 966.25 969.18 1008.48 1034.21 1045.39 1054.11 1088.26 1089.54 1100.19 1113.51 1121.70 1139.80 1162.77 1168.90 1179.31 1189.29 1194.88 1207.78 1216.49 1231.25 1240.10 1247.74 1248.40 1260.69 1279.35 1279.95 1283.96 1296.90 1304.92 1324.04 1335.59 1347.44 1349.63 1353.28 1355.01 1362.19 1372.23 1375.44 1396.54 1408.72 1421.26 1437.19 1444.70 1456.23 1492.70 1495.76 1501.04 1505.33 1508.40 1510.18 1517.16 1519.85 1525.44 1561.00 1589.36 1646.56 1667.93 1692.74 1702.17 3044.28 3045.73 3050.13 3050.95 3059.90 3075.67 3081.15 3084.46 3087.94 3089.76 3094.99 3103.10 3103.55 3120.03 3125.47 3142.40 3160.69 3163.84 3225.15 3237.10 3409.89 3417.11 3553.84 3566.15
formula: C9H24B12F12N2
InChI: InChI=1/C9H24N2.B12F12/c10-8-6-4-2-1-3-5-7-9-11;13-1-2(14)3(1,15)5(1,17)6(1,18)4(1,2,16)8(2,20)7(2,3,19)9(3,5,21)11(5,6,23)10(4,6,8,22)12(7,8,9,11)24/h1-9H2,10-11H3;
59 atoms
C  -0.704901 1.351927 0.25545
H  -0.342592 1.427658 1.28143
H  0.07066 1.718312 -0.417566
C  -1.138031 -0.064981 -0.086943
H  -1.347303 -0.124274 -1.158318
H  -2.080291 -0.267025 0.423005
C  -0.120139 -1.130299 0.308263
H  -0.053952 -1.17081 1.400663
H  0.876546 -0.863997 -0.058828
C  -0.509396 -2.511445 -0.233877
H  0.158335 -3.263141 0.198355
H  -0.341156 -2.534692 -1.316398
C  -1.96382 -2.887804 0.049195
H  -2.62711 -2.229362 -0.51654
H  -2.196418 -2.708107 1.10462
C  -2.288313 -4.342332 -0.285402
H  -1.736692 -4.99699 0.39532
H  -1.932904 -4.580953 -1.294787
C  -3.785955 -4.654348 -0.1884
H  -4.186119 -4.170719 0.70967
H  -3.933773 -5.730555 -0.055394
C  -4.569638 -4.216554 -1.429167
H  -4.23982 -4.809586 -2.285544
H  -4.362364 -3.171665 -1.678823
C  -6.076433 -4.4021 -1.284838
H  -6.311299 -5.320075 -0.744485
H  -6.576951 -4.431533 -2.252089
H  -6.719384 -2.412206 -1.121307
H  -7.618552 -3.429413 -0.187127
H  -6.099703 -2.979448 0.272164
N  -6.675218 -3.26041 -0.529033
B  -7.789134 1.117886 -0.446967
B  -6.325006 0.473403 1.990421
B  -6.19552 2.244705 1.707565
B  -7.100083 2.645682 0.201985
B  -5.523979 -0.34147 0.614188
B  -6.299637 1.8062 -1.173031
B  -5.321031 2.481854 0.163086
B  -4.859673 1.156447 1.254265
B  -7.727264 1.389676 1.333761
B  -6.421923 0.054114 -0.873905
F  -6.05281 3.131302 2.744325
F  -4.403087 3.517092 -0.032347
F  -7.724674 3.852485 0.038712
F  -8.867938 1.572994 2.068075
F  -6.308033 -0.100093 3.238536
F  -3.612817 1.204716 1.920703
F  -6.504772 -0.916366 -1.899284
F  -4.898174 -1.595565 0.767253
F  -3.74346 0.731841 -1.267588
F  -8.058891 -1.366116 0.811928
F  -8.972726 1.052604 -1.137267
F  -6.240312 2.320747 -2.444484
B  -4.916943 0.890845 -0.510604
B  -7.296403 -0.204001 0.654843
N  -1.889148 2.265534 0.144959
H  -2.544477 2.066418 0.920867
H  -1.656787 3.254773 0.169846
H  -2.431135 2.076274 -0.704987
totalener: -1965.32222220493941 hartree
nucrepener: 4286.94153167042168 hartree
electener: -6252.26375957971959 hartree
twoeener: 5001.14604196554774 hartree
kineticenergy: 1957.72124291702016 hartree
exchangeener: -162.671606735176 hartree
correlationener: -11.251129299174 hartree
xcener: -173.922736034349 hartree
energy: -673.8021 -673.7704 -673.7636 -673.6523 -673.1535 -673.0608 -672.4568 -672.4121 -672.2615 -672.2575 -672.0927 -672.0857 -396.2230 -396.0999 -282.4629 -282.4476 -280.8974 -280.6419 -280.4897 -280.4129 -280.1912 -280.1542 -279.9788 -187.1402 -187.0889 -187.0517 -187.0432 -186.8531 -186.8143 -186.7416 -186.7185 -186.6035 -186.6029 -186.5210 -186.5136 -36.1443 -36.0715 -35.9898 -35.9314 -35.4565 -35.3542 -34.8472 -34.8093 -34.6713 -34.6438 -34.5000 -34.4567 -31.9281 -31.8665 -27.0943 -26.7394 -25.7245 -25.1209 -24.7074 -23.3643 -22.2052 -21.5810 -20.9059 -20.8716 -20.8514 -20.5868 -20.2284 -20.1486 -19.9804 -19.7699 -19.3890 -18.1686 -17.9930 -17.8928 -17.8074 -17.7623 -17.7013 -17.5762 -17.2489 -17.1113 -16.7624 -16.6407 -16.5795 -16.4641 -16.4045 -16.3519 -16.1245 -16.0750 -15.9906 -15.8748 -15.7791 -15.7228 -15.6907 -15.6162 -15.4135 -15.3882 -15.2772 -15.2413 -15.2010 -15.0953 -15.0870 -14.9015 -14.7714 -14.7197 -14.6423 -14.5377 -14.4104 -14.2532 -14.2128 -14.1443 -14.0428 -13.9673 -13.8868 -13.7708 -13.6715 -13.6381 -13.5695 -13.3772 -13.3349 -13.3271 -13.2336 -13.0707 -12.8246 -12.4109 -12.2295 -12.1681 -12.0030 -11.9825 -11.9518 -11.8430 -11.8288 -8.9106 -8.8874 -8.8214 -8.7394 0.6332 1.4642 1.7245 2.1689 2.3336 2.5557 2.7577 2.8629 2.9928 3.1230 3.2401 electronvolt
chargesum: -0.0000000
charge: -0.133688 0.133313 0.126704 -0.090177 0.096181 0.071333 -0.167069 0.083081 0.079086 -0.157776 0.077761 0.072213 -0.059068 0.030698 0.079072 -0.172062 0.085688 0.065851 -0.133302 0.070917 0.094094 -0.148575 0.099202 0.096087 -0.131986 0.124992 0.143405 0.246277 0.227857 0.225277 -0.067329 0.187355 0.181407 0.201511 0.213990 0.218385 0.209030 0.184246 0.265062 0.208490 0.213449 -0.325746 -0.369117 -0.323002 -0.322291 -0.327522 -0.364585 -0.355795 -0.430775 -0.405424 -0.383250 -0.326152 -0.326250 0.233069 0.235542 -0.056489 0.244762 0.222245 0.229799
charge: 0.015138 0.028278 0.022289 -0.033334 0.026996 0.031735 -0.021490 0.022405 0.018502 -0.023404 0.020323 0.019078 -0.033555 0.017078 0.024420 -0.021275 0.020153 0.020584 -0.027510 0.018656 0.018345 -0.024082 0.028603 0.027620 0.011468 0.025162 0.026417 0.006471 0.041371 0.025920 0.604917 -0.436908 -0.439889 -0.437150 -0.432041 -0.449580 -0.439961 -0.438445 -0.432852 -0.433414 -0.425652 0.320789 0.271968 0.326819 0.326764 0.315507 0.302371 0.299913 0.279686 0.281988 0.271479 0.320473 0.317470 -0.455715 -0.438987 0.605659 0.005499 0.040010 0.036918
qa: -0.1337 0.1333 0.1267 -0.0902 0.0962 0.0713 -0.1671 0.0831 0.0791 -0.1578 0.0778 0.0722 -0.0591 0.0307 0.0791 -0.1721 0.0857 0.0659 -0.1333 0.0709 0.0941 -0.1486 0.0992 0.0961 -0.1320 0.1250 0.1434 0.2463 0.2279 0.2253 -0.0673 0.1874 0.1814 0.2015 0.2140 0.2184 0.2090 0.1842 0.2651 0.2085 0.2134 -0.3257 -0.3691 -0.3230 -0.3223 -0.3275 -0.3646 -0.3558 -0.4308 -0.4054 -0.3833 -0.3262 -0.3263 0.2331 0.2355 -0.0565 0.2448 0.2222 0.2298
va: 3.8548 0.9976 0.9983 3.8122 1.0115 1.0402 3.9327 1.0050 1.0099 3.9168 1.0120 1.0057 3.8402 1.0309 1.0106 3.9595 1.0062 1.0068 3.8552 1.0211 1.0110 3.8451 1.0102 1.0175 3.8707 0.9972 0.9963 1.0399 0.9760 1.0100 3.6515 3.5662 3.6867 3.5725 3.5620 3.2593 3.6563 3.5175 3.3843 3.5996 3.5256 1.1112 1.0333 1.1184 1.1189 1.1086 1.0278 1.0411 0.9316 0.9673 1.0100 1.1102 1.1115 3.3298 3.4557 3.6546 1.0323 0.9769 0.9998
dispcorr: -0.164352408 hartree
energy: -1965.487679605701
temp: 298.15 k
press: 1.00 atm
zeropoint: 0.43997789 hartree
thermalvibcorrection: 0.03235981 hartree
thermalrotcorrection: 0.00141627 hartree
thermaltrasncorrection: 0.00141627 hartree
thermaltotal: -1965.01250936 hartree
thermalcorr: 0.03519235 hartree
nonthermalcorr: 0.43997789 hartree
totalcorr: 0.47517024 hartree
thermalcorrenthalpy: 0.00094421 hartree
totalenthalpy: -1965.01156515 hartree
totalentropycorr: -0.09556413 hartree
gibbsenthalpy: -1965.10712929 hartree
gibbsminuselec: 0.38055032 hartree
