program: Orca
programVersion: 6.0.0
elementType: C H H C H H C H H C H H C H H C H H C H H C H H H H H N B B B B B B B B B B F F F F F F F F F F F F B B N H H H
charge: 0
multiplicity: 1
keywords: opt freq wB97x-D3BJ def2-TZVPP TightSCF defgrid3 RIJCOSX
keywords: PAL8
frequency: 0.00 0.00 0.00 0.00 0.00 0.00 27.26 39.23 56.85 67.58 80.28 91.72 103.58 111.94 129.89 134.09 141.37 146.18 169.45 170.34 171.20 172.53 174.96 176.23 179.44 182.97 184.67 186.18 186.65 190.31 191.53 197.58 200.91 205.74 212.79 216.79 231.62 236.09 244.50 263.91 270.33 285.11 289.79 296.71 328.03 336.61 390.85 399.72 400.40 402.49 404.54 405.74 426.02 439.21 474.02 486.01 487.02 490.57 522.33 557.61 560.84 564.46 669.63 673.90 676.51 678.40 682.39 721.33 738.47 744.67 746.60 749.50 760.66 794.51 799.83 803.85 809.84 819.74 824.69 828.17 831.72 835.02 837.36 841.93 844.28 849.95 853.36 862.74 919.73 939.42 949.60 961.31 993.64 1003.60 1035.80 1039.49 1046.56 1074.24 1085.90 1105.37 1126.72 1140.59 1157.77 1172.70 1175.58 1192.96 1199.16 1200.96 1221.46 1243.00 1245.06 1246.97 1248.74 1271.52 1278.18 1282.17 1296.70 1303.26 1309.74 1340.95 1347.48 1350.69 1352.92 1355.52 1359.59 1369.37 1383.35 1408.09 1418.55 1437.83 1449.28 1453.74 1499.36 1501.13 1503.16 1506.59 1508.22 1516.36 1523.31 1524.78 1559.71 1567.93 1639.85 1644.49 1700.44 1703.19 3046.58 3055.20 3059.43 3069.13 3071.84 3088.19 3098.22 3098.65 3104.16 3108.48 3114.08 3122.95 3131.58 3153.79 3177.99 3181.56 3195.81 3278.47 3334.80 3418.34 3566.01 3570.71
frequency: 27.26 39.23 56.85 67.58 80.28 91.72 103.58 111.94 129.89 134.09 141.37 146.18 169.45 170.34 171.20 172.53 174.96 176.23 179.44 182.97 184.67 186.18 186.65 190.31 191.53 197.58 200.91 205.74 212.79 216.79 231.62 236.09 244.50 263.91 270.33 285.11 289.79 296.71 328.03 336.61 390.85 399.72 400.40 402.49 404.54 405.74 426.02 439.21 474.02 486.01 487.02 490.57 522.33 557.61 560.84 564.46 669.63 673.90 676.51 678.40 682.39 721.33 738.47 744.67 746.60 749.50 760.66 794.51 799.83 803.85 809.84 819.74 824.69 828.17 831.72 835.02 837.36 841.93 844.28 849.95 853.36 862.74 919.73 939.42 949.60 961.31 993.64 1003.60 1035.80 1039.49 1046.56 1074.24 1085.90 1105.37 1126.72 1140.59 1157.77 1172.70 1175.58 1192.96 1199.16 1200.96 1221.46 1243.00 1245.06 1246.97 1248.74 1271.52 1278.18 1282.17 1296.70 1303.26 1309.74 1340.95 1347.48 1350.69 1352.92 1355.52 1359.59 1369.37 1383.35 1408.09 1418.55 1437.83 1449.28 1453.74 1499.36 1501.13 1503.16 1506.59 1508.22 1516.36 1523.31 1524.78 1559.71 1567.93 1639.85 1644.49 1700.44 1703.19 3046.58 3055.20 3059.43 3069.13 3071.84 3088.19 3098.22 3098.65 3104.16 3108.48 3114.08 3122.95 3131.58 3153.79 3177.99 3181.56 3195.81 3278.47 3334.80 3418.34 3566.01 3570.71
formula: C8H22B12F12N2
InChI: InChI=1/C8H22N2.B12F12/c9-7-5-3-1-2-4-6-8-10;13-1-2(14)3(1,15)5(1,17)6(1,18)4(1,2,16)8(2,20)7(2,3,19)9(3,5,21)11(5,6,23)10(4,6,8,22)12(7,8,9,11)24/h1-8H2,9-10H3;
56 atoms
C  1.320127 2.155822 1.208861
H  0.473105 2.482273 1.812412
H  1.96921 1.529695 1.814871
C  0.911903 1.412282 -0.058155
H  1.768434 1.425891 -0.735696
H  0.095018 1.933093 -0.566286
C  0.551736 -0.057647 0.223681
H  -0.525543 -0.174431 0.371015
H  1.032412 -0.364083 1.155285
C  1.055361 -0.984347 -0.886849
H  2.068174 -0.663749 -1.138865
H  0.457716 -0.851425 -1.795032
C  1.083097 -2.466007 -0.496893
H  0.080501 -2.894818 -0.575739
H  1.378705 -2.557593 0.553583
C  2.06458 -3.278514 -1.353278
H  1.901306 -3.041442 -2.410939
H  1.867623 -4.348367 -1.236945
C  3.51437 -2.968624 -0.974372
H  3.729103 -3.346306 0.028249
H  3.646268 -1.889488 -0.927521
C  4.530239 -3.531065 -1.962105
H  4.216199 -3.363668 -2.992997
H  4.698931 -4.598683 -1.819621
H  6.10503 -2.745897 -0.797992
H  6.611572 -3.274823 -2.301486
H  5.761331 -1.858025 -2.116556
N  5.849407 -2.83255 -1.795382
B  7.608874 0.352909 1.170083
B  6.633358 1.763514 -1.180994
B  6.502706 2.866076 0.22657
B  7.107714 1.997523 1.680175
B  5.55474 0.382385 -0.860659
B  6.021626 0.596386 1.985109
B  5.350053 2.134254 1.38709
B  5.066321 1.990328 -0.358612
B  7.909507 1.75451 0.081577
B  6.152088 -0.484104 0.581732
F  6.584098 4.231674 0.096406
F  4.491652 2.929875 2.169387
F  7.715442 2.66716 2.708674
F  9.173776 2.214533 -0.170836
F  6.831708 2.200237 -2.467619
F  3.980525 2.660897 -0.973391
F  6.017549 -1.883834 0.705181
F  4.933591 -0.285483 -1.940392
F  3.474447 0.116534 0.946229
F  7.98865 -0.673177 -1.418629
F  8.62215 -0.347532 1.772546
F  5.739906 0.117331 3.241072
B  4.76234 0.595228 0.712642
B  7.297717 0.20794 -0.590058
N  2.1408 3.37423 0.873244
H  1.570868 4.179132 0.630074
H  2.776176 3.607883 1.643523
H  2.774392 3.164125 0.078026
totalener: -1925.96722026221641 hartree
nucrepener: 4130.10417191622128 hartree
electener: -6056.07140187355435 hartree
twoeener: 4832.04221531563053 hartree
kineticenergy: 1918.61318081578383 hartree
exchangeener: -158.801914918813 hartree
correlationener: -10.933769163697 hartree
xcener: -169.735684082510 hartree
energy: -673.8685 -673.8223 -673.6418 -673.4041 -673.3553 -672.8928 -672.4007 -672.3975 -672.3350 -672.1918 -672.0959 -672.0599 -396.2977 -396.1672 -282.4176 -282.2371 -280.7048 -280.5527 -280.3795 -280.2400 -280.0842 -280.0058 -187.0652 -187.0544 -187.0319 -186.9603 -186.9093 -186.7707 -186.6953 -186.6850 -186.6190 -186.5463 -186.5046 -186.4993 -36.1777 -36.1003 -35.9270 -35.7218 -35.6470 -35.1926 -34.8044 -34.7896 -34.7079 -34.5981 -34.4892 -34.4388 -31.9487 -31.8703 -26.9666 -26.4864 -25.3474 -25.0904 -24.0778 -22.6289 -21.6786 -20.9081 -20.8920 -20.8279 -20.7813 -20.5356 -20.1768 -20.1083 -19.5681 -19.5271 -17.9386 -17.8943 -17.8616 -17.8263 -17.7478 -17.6340 -17.5550 -17.2639 -17.0594 -16.9875 -16.6136 -16.4868 -16.3920 -16.3651 -16.2134 -16.0377 -15.8913 -15.8420 -15.7716 -15.7297 -15.7127 -15.6176 -15.4068 -15.3228 -15.3046 -15.1909 -15.1618 -15.1182 -14.9871 -14.8565 -14.7188 -14.6875 -14.6250 -14.5070 -14.3852 -14.2565 -14.1929 -14.0972 -13.9854 -13.8402 -13.7365 -13.6759 -13.6360 -13.5596 -13.4605 -13.3271 -13.3163 -13.2236 -13.2104 -12.9344 -12.5385 -12.3377 -12.1301 -11.9771 -11.9595 -11.9078 -11.8177 -11.7898 -8.9031 -8.8579 -8.7910 -8.6975 0.6593 1.2399 1.5251 2.3456 2.4137 2.5623 2.9384 2.9733 3.1843 3.2326 3.4853 electronvolt
chargesum: -0.0000000
charge: -0.144531 0.138253 0.154013 -0.154009 0.087604 0.103383 -0.157642 0.093756 0.078246 -0.108206 0.054707 0.086554 -0.150302 0.088268 0.076250 -0.176181 0.070477 0.088410 -0.064517 0.103704 0.045231 -0.138562 0.128169 0.130427 0.233787 0.218577 0.240878 -0.057159 0.205799 0.221344 0.179735 0.221111 0.249232 0.172415 0.267231 0.253719 0.218461 0.274921 -0.328993 -0.408712 -0.322612 -0.323026 -0.325720 -0.372038 -0.380956 -0.390962 -0.428533 -0.357769 -0.324943 -0.326788 0.182814 0.151818 -0.055651 0.208625 0.238221 0.231671
charge: 0.020261 0.018527 0.028040 -0.021000 0.027702 0.015018 -0.014918 0.014765 0.021872 -0.024116 0.018459 0.016238 -0.017360 0.016659 0.023353 -0.018503 0.020348 0.017874 -0.021386 0.027226 0.024450 0.016205 0.025255 0.022466 0.008030 0.037148 0.018021 0.607268 -0.436782 -0.441115 -0.438080 -0.434027 -0.450933 -0.439534 -0.423027 -0.425142 -0.430698 -0.433836 0.314712 0.276679 0.325437 0.325848 0.317322 0.305142 0.301969 0.290685 0.297559 0.277312 0.321828 0.316382 -0.465759 -0.437111 0.605002 0.032148 0.025487 -0.005370
qa: -0.1445 0.1383 0.1540 -0.1540 0.0876 0.1034 -0.1576 0.0938 0.0782 -0.1082 0.0547 0.0866 -0.1503 0.0883 0.0762 -0.1762 0.0705 0.0884 -0.0645 0.1037 0.0452 -0.1386 0.1282 0.1304 0.2338 0.2186 0.2409 -0.0572 0.2058 0.2213 0.1797 0.2211 0.2492 0.1724 0.2672 0.2537 0.2185 0.2749 -0.3290 -0.4087 -0.3226 -0.3230 -0.3257 -0.3720 -0.3810 -0.3910 -0.4285 -0.3578 -0.3249 -0.3268 0.1828 0.1518 -0.0557 0.2086 0.2382 0.2317
va: 3.8231 0.9987 1.0007 3.8370 1.0252 1.0068 3.9190 1.0065 1.0120 3.8919 1.0079 1.0082 3.9410 1.0053 1.0079 3.9744 1.0046 1.0071 3.8169 1.0152 1.0430 3.8515 1.0000 0.9979 1.0288 0.9788 1.0134 3.6354 3.5837 3.6175 3.5966 3.5802 3.3947 3.7448 3.3461 3.3731 3.5399 3.3425 1.1049 0.9694 1.1177 1.1174 1.1126 1.0191 1.0080 0.9784 0.9487 1.0513 1.1135 1.1097 3.2864 3.5981 3.6174 0.9825 0.9986 1.0570
dispcorr: -0.159201146 hartree
energy: -1926.126411978484
temp: 298.15 k
press: 1.00 atm
zeropoint: 0.41101242 hartree
thermalvibcorrection: 0.03118945 hartree
thermalrotcorrection: 0.00141627 hartree
thermaltrasncorrection: 0.00141627 hartree
thermaltotal: -1925.68137756 hartree
thermalcorr: 0.03402199 hartree
nonthermalcorr: 0.41101242 hartree
totalcorr: 0.44503442 hartree
thermalcorrenthalpy: 0.00094421 hartree
totalenthalpy: -1925.68043335 hartree
totalentropycorr: -0.09336767 hartree
gibbsenthalpy: -1925.77380102 hartree
gibbsminuselec: 0.35261095 hartree
