program: Orca
programVersion: 6.0.0
elementType: B B B B B B B B B B F F F F F F F F F F F F B B C H H C H H C H H C H H C H H N H H N H H H
charge: -1
multiplicity: 1
keywords: opt freq wB97x-D3BJ def2-TZVPP TightSCF defgrid3 RIJCOSX
keywords: PAL8
frequency: 0.00 0.00 0.00 0.00 0.00 0.00 16.44 38.68 40.06 50.96 73.27 91.32 102.37 123.43 155.27 170.46 171.13 171.63 172.45 174.47 174.82 176.29 177.49 183.45 184.64 185.79 186.60 186.93 188.50 189.43 194.63 198.69 205.64 224.37 236.07 238.50 261.09 275.09 292.12 305.87 322.93 395.21 399.26 399.95 400.93 403.50 408.07 436.30 445.74 485.43 486.00 487.18 503.48 557.04 562.55 564.46 670.49 673.39 676.10 678.25 680.46 736.46 744.47 747.00 749.71 771.71 801.10 802.19 809.31 809.68 812.41 816.79 826.59 829.25 830.25 833.64 839.77 846.76 851.07 858.80 901.83 917.12 935.81 1008.62 1025.18 1034.64 1076.13 1091.16 1106.09 1124.92 1157.36 1163.99 1177.47 1200.05 1212.83 1219.90 1227.25 1229.65 1235.51 1239.78 1268.40 1283.31 1284.48 1286.31 1301.96 1334.80 1346.28 1353.09 1366.55 1380.76 1393.50 1400.92 1437.47 1447.39 1495.96 1501.61 1504.44 1515.18 1520.13 1524.77 1615.08 1682.88 1706.75 3034.92 3039.97 3060.18 3061.76 3073.97 3087.58 3104.22 3120.39 3128.75 3195.22 3261.11 3403.28 3531.44 3582.85 3600.35
frequency: 16.44 38.68 40.06 50.96 73.27 91.32 102.37 123.43 155.27 170.46 171.13 171.63 172.45 174.47 174.82 176.29 177.49 183.45 184.64 185.79 186.60 186.93 188.50 189.43 194.63 198.69 205.64 224.37 236.07 238.50 261.09 275.09 292.12 305.87 322.93 395.21 399.26 399.95 400.93 403.50 408.07 436.30 445.74 485.43 486.00 487.18 503.48 557.04 562.55 564.46 670.49 673.39 676.10 678.25 680.46 736.46 744.47 747.00 749.71 771.71 801.10 802.19 809.31 809.68 812.41 816.79 826.59 829.25 830.25 833.64 839.77 846.76 851.07 858.80 901.83 917.12 935.81 1008.62 1025.18 1034.64 1076.13 1091.16 1106.09 1124.92 1157.36 1163.99 1177.47 1200.05 1212.83 1219.90 1227.25 1229.65 1235.51 1239.78 1268.40 1283.31 1284.48 1286.31 1301.96 1334.80 1346.28 1353.09 1366.55 1380.76 1393.50 1400.92 1437.47 1447.39 1495.96 1501.61 1504.44 1515.18 1520.13 1524.77 1615.08 1682.88 1706.75 3034.92 3039.97 3060.18 3061.76 3073.97 3087.58 3104.22 3120.39 3128.75 3195.22 3261.11 3403.28 3531.44 3582.85 3600.35
formula: C5H15B12F12N2
InChI: InChI=1/C5H15N2.B12F12/c6-4-2-1-3-5-7;13-1-2(14)3(1,15)5(1,17)6(1,18)4(1,2,16)8(2,20)7(2,3,19)9(3,5,21)11(5,6,23)10(4,6,8,22)12(7,8,9,11)24/h1-6H2,7H3;
46 atoms
B  2.962767 0.313547 0.632043
B  1.366391 -0.28234 -1.711846
B  0.786304 1.278966 -1.027669
B  1.773506 1.644853 0.421337
B  1.071397 -1.546391 -0.485739
B  1.48267 0.365277 1.642938
B  0.133044 0.955735 0.614932
B  -0.086521 -0.220321 -0.696629
B  2.533505 0.878067 -1.017109
B  2.06059 -1.195221 0.95582
F  0.238468 2.261358 -1.829083
F  -0.947594 1.662889 1.133329
F  2.057046 2.942167 0.790056
F  3.435408 1.557864 -1.806176
F  1.265453 -0.564204 -3.060886
F  -1.356418 -0.508195 -1.270709
F  2.5305 -2.214046 1.761741
F  0.654133 -2.847514 -0.823512
F  -0.585563 -1.529888 1.715739
F  3.74561 -1.626189 -1.211574
F  4.210965 0.538692 1.1699
F  1.510604 0.611409 2.999906
B  0.333033 -0.782138 0.938232
B  2.710357 -0.881797 -0.687585
C  -3.256463 -2.080647 0.515255
H  -2.829397 -1.233109 1.044025
H  -3.686086 -2.759052 1.252819
C  -4.279115 -1.627803 -0.52234
H  -4.995449 -2.430813 -0.719998
H  -3.766237 -1.408518 -1.463028
C  -4.995733 -0.353736 -0.05745
H  -5.894409 -0.206307 -0.663806
H  -5.340948 -0.484318 0.975722
C  -4.097046 0.878776 -0.157411
H  -3.141591 0.706402 0.342781
H  -3.847934 1.058465 -1.208548
C  -4.716408 2.140758 0.44105
H  -4.977581 1.952361 1.488442
H  -5.656722 2.375968 -0.071145
N  -3.859119 3.320956 0.395434
H  -2.973607 3.116073 0.846779
H  -3.626097 3.539899 -0.565916
N  -2.084182 -2.764522 -0.111332
H  -1.323572 -2.858263 0.571492
H  -2.302458 -3.666365 -0.52214
H  -1.702491 -2.135413 -0.837773
totalener: -1807.43045774752500 hartree
nucrepener: 3463.94074320894879 hartree
electener: -5271.37122407341758 hartree
oneelecener: -9425.93750858861677 hartree
twoeener: 4154.56628451519919 hartree
kineticenergy: 1800.75946577787226 hartree
exchangeener: -147.090617871604 hartree
correlationener: -9.963269249062 hartree
xcener: -157.053887120666 hartree
energy: -671.1513 -670.9212 -670.5358 -670.0972 -669.7379 -669.7054 -669.6899 -669.6192 -669.5505 -669.4657 -669.4235 -669.4093 -393.9144 -389.2497 -280.0031 -278.7010 -278.2264 -278.0963 -277.4253 -184.1715 -184.1449 -184.0614 -183.9995 -183.8390 -183.8186 -183.8173 -183.7901 -183.7579 -183.6792 -183.6447 -183.6298 -33.4370 -33.1793 -32.7776 -32.4073 -32.1130 -32.0756 -32.0175 -31.9657 -31.9115 -31.8351 -31.7580 -31.7324 -29.6387 -25.5516 -24.4980 -22.3816 -22.1428 -20.5708 -18.9169 -18.2326 -17.9675 -17.8979 -17.8552 -17.8117 -17.1815 -15.7453 -15.0525 -14.9505 -14.8554 -14.7767 -14.6511 -14.5449 -14.5135 -14.1756 -13.6711 -13.6099 -13.5878 -13.4388 -13.2529 -13.1607 -13.0078 -12.9643 -12.9154 -12.8815 -12.8006 -12.6609 -12.5139 -12.4289 -12.4163 -12.3058 -12.2796 -12.2534 -12.2121 -11.9205 -11.8916 -11.7521 -11.6632 -11.5238 -11.3209 -11.2160 -11.0737 -11.0078 -10.9422 -10.9096 -10.8718 -10.8492 -10.8184 -10.7928 -10.5648 -10.5233 -10.5071 -10.4145 -9.9202 -9.0752 -9.0429 -9.0193 -8.9223 -8.8864 -7.2722 -5.9498 -5.9210 -5.9138 -5.8171 3.2584 3.7944 4.3482 4.8814 5.1177 5.4639 5.6185 5.7844 5.9356 6.2575 6.3823 electronvolt
chargesum: -1.0000000
charge: 0.224897 0.162494 0.193012 0.206629 0.200448 0.187336 0.211827 0.287744 0.215971 0.180070 -0.347945 -0.396372 -0.342049 -0.343288 -0.347643 -0.407498 -0.346965 -0.383653 -0.410204 -0.345210 -0.343643 -0.343730 0.248468 0.212281 -0.125992 0.154300 0.118653 -0.140032 0.085790 0.089958 -0.168469 0.069654 0.063707 -0.052624 0.032482 0.059264 -0.021700 0.051748 0.048921 -0.355893 0.159662 0.130988 -0.043692 0.235051 0.200396 0.234850
charge: -0.433876 -0.439619 -0.438270 -0.434156 -0.441206 -0.436950 -0.438247 -0.439811 -0.433493 -0.439725 0.294817 0.277409 0.301996 0.302893 0.293566 0.285976 0.294521 0.248291 0.265121 0.299529 0.303327 0.298817 -0.441403 -0.434092 0.014556 0.033015 0.017319 -0.028663 0.010815 0.026273 -0.024547 0.016614 0.018299 -0.039200 0.021030 0.018872 -0.101724 0.010027 0.006659 0.219335 -0.048327 -0.059602 0.606705 0.030193 0.029101 0.007833
qa: 0.2249 0.1625 0.1930 0.2066 0.2004 0.1873 0.2118 0.2877 0.2160 0.1801 -0.3479 -0.3964 -0.3420 -0.3433 -0.3476 -0.4075 -0.3470 -0.3837 -0.4102 -0.3452 -0.3436 -0.3437 0.2485 0.2123 -0.1260 0.1543 0.1187 -0.1400 0.0858 0.0900 -0.1685 0.0697 0.0637 -0.0526 0.0325 0.0593 -0.0217 0.0517 0.0489 -0.3559 0.1597 0.1310 -0.0437 0.2351 0.2004 0.2348
va: 3.4595 3.5580 3.5359 3.5035 3.4351 3.6275 3.3133 3.0467 3.4655 3.5424 1.0772 0.9995 1.0869 1.0850 1.0771 0.9623 1.0785 1.0033 0.9527 1.0837 1.0851 1.0861 3.2817 3.4791 3.8556 0.9919 1.0006 3.8497 1.0063 1.0199 3.9564 1.0087 1.0076 3.8279 1.0465 1.0204 4.0121 0.9980 0.9992 3.0662 1.0367 1.0303 3.6477 1.0019 0.9875 1.0301
dispcorr: -0.136086827 hartree
energy: -1807.567840333763
temp: 298.15 k
press: 1.00 atm
zeropoint: 0.30822446 hartree
thermalvibcorrection: 0.02796009 hartree
thermalrotcorrection: 0.00141627 hartree
thermaltrasncorrection: 0.00141627 hartree
thermaltotal: -1807.22882323 hartree
thermalcorr: 0.03079264 hartree
nonthermalcorr: 0.30822446 hartree
totalcorr: 0.33901710 hartree
thermalcorrenthalpy: 0.00094421 hartree
totalenthalpy: -1807.22787902 hartree
totalentropycorr: -0.08768527 hartree
gibbsenthalpy: -1807.31556430 hartree
gibbsminuselec: 0.25227604 hartree
