program: Orca
programVersion: 6.0.0
elementType: C H H C H H C H H C H H H H H N B B B B B B B B B B F F F F F F F F F F F F B B B B B B B B B B B B F F F F F F F F F F F F B B N H H H
charge: -2
multiplicity: 1
keywords: opt freq wB97x-D3BJ def2-TZVPP TightSCF defgrid3 RIJCOSX
keywords: PAL8
frequency: 0.00 0.00 0.00 0.00 0.00 0.00 9.30 9.85 10.57 11.45 27.47 45.54 67.07 70.47 72.97 102.33 110.31 123.19 142.26 162.45 164.29 168.85 170.44 170.48 170.93 171.44 171.71 171.76 172.03 172.77 173.99 174.82 174.83 175.13 176.01 176.62 176.94 177.88 184.00 184.03 184.56 185.42 186.30 186.36 186.98 187.25 188.24 188.30 188.43 189.34 195.03 195.14 203.06 204.94 229.25 229.79 235.07 235.76 238.50 239.05 274.07 280.89 281.14 312.56 352.40 362.78 364.41 371.86 399.19 399.24 399.35 399.37 399.92 399.97 400.50 400.56 403.11 404.22 435.47 435.64 484.20 484.21 484.83 484.99 487.03 487.04 510.89 556.92 556.96 562.40 562.42 564.18 564.19 670.43 670.43 673.43 673.48 675.76 675.80 677.94 677.98 679.44 679.47 743.40 745.60 746.60 747.20 749.09 749.62 754.43 800.62 800.69 803.83 804.75 804.80 809.80 809.85 810.72 810.84 813.58 813.69 815.58 815.67 826.85 826.88 828.06 828.11 832.90 832.96 839.38 839.44 844.94 845.10 849.62 849.88 854.08 854.19 912.83 931.21 957.55 1012.57 1044.00 1071.12 1074.36 1100.91 1127.11 1152.55 1155.77 1166.25 1166.74 1199.96 1202.26 1210.27 1219.33 1220.15 1226.43 1227.00 1227.47 1227.53 1236.00 1236.12 1239.07 1239.62 1241.94 1266.95 1268.33 1284.03 1284.50 1285.38 1286.01 1324.83 1337.15 1345.56 1345.75 1358.17 1371.37 1372.74 1403.79 1449.54 1474.93 1511.00 1511.39 1521.45 1532.70 1581.54 1583.33 1647.96 1648.69 1704.35 1704.62 3079.71 3086.37 3103.59 3104.99 3117.25 3133.23 3158.61 3162.20 3245.59 3246.19 3257.07 3258.77 3576.08 3576.30
frequency: 9.30 9.85 10.57 11.45 27.47 45.54 67.07 70.47 72.97 102.33 110.31 123.19 142.26 162.45 164.29 168.85 170.44 170.48 170.93 171.44 171.71 171.76 172.03 172.77 173.99 174.82 174.83 175.13 176.01 176.62 176.94 177.88 184.00 184.03 184.56 185.42 186.30 186.36 186.98 187.25 188.24 188.30 188.43 189.34 195.03 195.14 203.06 204.94 229.25 229.79 235.07 235.76 238.50 239.05 274.07 280.89 281.14 312.56 352.40 362.78 364.41 371.86 399.19 399.24 399.35 399.37 399.92 399.97 400.50 400.56 403.11 404.22 435.47 435.64 484.20 484.21 484.83 484.99 487.03 487.04 510.89 556.92 556.96 562.40 562.42 564.18 564.19 670.43 670.43 673.43 673.48 675.76 675.80 677.94 677.98 679.44 679.47 743.40 745.60 746.60 747.20 749.09 749.62 754.43 800.62 800.69 803.83 804.75 804.80 809.80 809.85 810.72 810.84 813.58 813.69 815.58 815.67 826.85 826.88 828.06 828.11 832.90 832.96 839.38 839.44 844.94 845.10 849.62 849.88 854.08 854.19 912.83 931.21 957.55 1012.57 1044.00 1071.12 1074.36 1100.91 1127.11 1152.55 1155.77 1166.25 1166.74 1199.96 1202.26 1210.27 1219.33 1220.15 1226.43 1227.00 1227.47 1227.53 1236.00 1236.12 1239.07 1239.62 1241.94 1266.95 1268.33 1284.03 1284.50 1285.38 1286.01 1324.83 1337.15 1345.56 1345.75 1358.17 1371.37 1372.74 1403.79 1449.54 1474.93 1511.00 1511.39 1521.45 1532.70 1581.54 1583.33 1647.96 1648.69 1704.35 1704.62 3079.71 3086.37 3103.59 3104.99 3117.25 3133.23 3158.61 3162.20 3245.59 3246.19 3257.07 3258.77 3576.08 3576.30
formula: C4H14B24F24N2
InChI: InChI=1/C4H14N2.2B12F12/c5-3-1-2-4-6;2*13-1-2(14)3(1,15)5(1,17)6(1,18)4(1,2,16)8(2,20)7(2,3,19)9(3,5,21)11(5,6,23)10(4,6,8,22)12(7,8,9,11)24/h1-4H2,5-6H3;;
68 atoms
C  -0.845142 1.73876 -0.065417
H  -0.380077 2.20472 0.804058
H  -0.372842 2.139885 -0.962887
C  -0.733427 0.22151 -0.009654
H  -1.248604 -0.209946 -0.871679
H  -1.254971 -0.146028 0.877659
C  0.727446 -0.210282 0.011205
H  1.243378 0.221624 0.872487
H  1.249024 0.156052 -0.876761
C  0.838258 -1.727629 0.068482
H  0.370078 -2.194134 -0.799007
H  0.368829 -2.127737 0.967874
H  2.765457 -1.678544 0.880826
H  2.437214 -3.1224 0.119918
H  2.765958 -1.736581 -0.742269
N  2.27619 -2.120502 0.083951
B  6.308813 -0.67595 1.487125
B  6.314305 -0.78987 -1.41491
B  7.544767 0.400984 -0.903597
B  7.541446 0.47129 0.88869
B  4.739767 -0.168164 -0.879106
B  5.943768 1.085821 1.418438
B  6.706086 1.749017 -0.060535
B  5.949332 0.971691 -1.486079
B  7.2981 -1.100118 0.052404
B  4.736533 -0.098395 0.8982
F  8.696509 0.610019 -1.632986
F  7.181283 3.042978 -0.110423
F  8.690548 0.737268 1.603586
F  8.239525 -2.108013 0.093604
F  6.41973 -1.557649 -2.558794
F  5.782447 1.62454 -2.690537
F  3.552577 -0.358627 1.641352
F  3.558298 -0.486113 -1.603591
F  3.957824 2.355881 -0.089774
F  4.969463 -2.718708 0.111368
F  6.409461 -1.351774 2.688042
F  5.772248 1.831058 2.567333
B  4.952038 1.390461 -0.049934
B  5.550387 -1.439314 0.062274
B  -4.943874 -1.390071 0.041853
B  -6.313302 0.676109 -1.484043
B  -5.55473 1.437517 -0.058267
B  -4.736313 0.166447 0.876648
B  -7.539413 -0.478793 -0.887205
B  -5.939385 -0.981256 1.481914
B  -6.312375 0.778904 1.41841
B  -7.30098 1.090254 -0.045467
B  -4.737092 0.103205 -0.901112
B  -6.696187 -1.756475 0.055406
F  -4.980352 2.719825 -0.104054
F  -6.418817 1.542039 2.56531
F  -3.554643 0.486756 1.599573
F  -3.5559 0.370754 -1.646171
F  -6.420108 1.35633 -2.681908
F  -8.246439 2.094603 -0.080779
F  -7.16577 -3.052568 0.101679
F  -8.688812 -0.74729 -1.600626
F  -8.687878 -0.632283 1.63667
F  -5.767992 -1.824068 -2.575248
F  -3.945058 -2.351165 0.075662
F  -5.766417 -1.638137 2.683288
B  -7.538838 -0.415211 0.905341
B  -5.940329 -1.084188 -1.42303
N  -2.283026 2.131855 -0.085866
H  -2.775832 1.751215 0.739898
H  -2.443979 3.133582 -0.126115
H  -2.769411 1.686362 -0.8827
totalener: -3266.77978965103966 hartree
nucrepener: 7482.84427830555160 hartree
twoeener: 8760.98632178200205 hartree
kineticenergy: 3255.07917069411315 hartree
exchangeener: -261.081906060717 hartree
correlationener: -17.269337126922 hartree
xcener: -278.351243187639 hartree
energy: -670.1343 -670.1315 -670.1313 -670.1279 -669.5829 -669.5800 -668.9938 -668.9908 -668.8038 -668.8032 -668.8013 -668.8010 -668.7190 -668.7188 -668.7167 -668.7164 -668.6613 -668.6595 -668.5684 -668.5661 -668.5411 -668.5406 -668.5388 -668.5386 -392.6461 -392.6399 -279.1086 -279.1047 -277.6072 -277.6017 -183.2380 -183.2349 -183.2312 -183.2280 -183.1473 -183.1446 -183.0162 -183.0135 -182.9085 -182.9082 -182.9064 -182.9059 -182.8711 -182.8707 -182.8685 -182.8682 -182.8361 -182.8347 -182.7554 -182.7528 -182.7276 -182.7253 -182.7225 -182.7201 -32.4462 -32.4428 -32.3389 -32.3354 -31.8385 -31.8351 -31.3233 -31.3210 -31.1842 -31.1819 -31.1651 -31.1627 -31.0656 -31.0632 -31.0548 -31.0523 -31.0137 -31.0118 -30.9342 -30.9319 -30.8639 -30.8616 -30.8491 -30.8469 -28.4627 -28.4369 -23.7620 -21.8105 -21.2096 -21.2072 -19.4803 -18.2183 -17.0148 -17.0121 -17.0008 -16.9858 -16.9552 -16.9270 -16.7905 -16.6432 -16.5543 -16.1635 -14.7875 -14.4242 -14.2078 -14.0965 -14.0400 -14.0207 -14.0178 -13.8252 -13.7901 -13.6672 -13.6644 -13.6346 -13.5920 -13.2327 -13.2038 -12.8350 -12.7195 -12.7096 -12.6830 -12.6700 -12.5072 -12.4587 -12.4181 -12.2774 -12.1547 -12.1264 -12.0556 -12.0135 -11.9960 -11.9795 -11.9702 -11.9276 -11.9038 -11.8765 -11.7452 -11.6953 -11.6651 -11.5655 -11.5264 -11.4998 -11.4876 -11.3794 -11.3767 -11.3660 -11.3627 -11.3468 -11.3380 -11.2938 -11.0778 -10.9996 -10.9648 -10.9159 -10.8271 -10.7647 -10.6708 -10.5711 -10.5280 -10.4282 -10.3749 -10.3657 -10.2854 -10.2830 -10.0269 -10.0237 -9.9789 -9.9632 -9.9573 -9.9535 -9.9441 -9.9407 -9.9107 -9.8941 -9.8915 -9.8878 -9.8850 -9.6638 -9.6616 -9.6235 -9.6213 -9.6153 -9.6131 -8.1618 -8.1587 -8.1194 -8.1163 -8.0850 -8.0827 -7.9909 -7.9886 -7.9645 -7.9610 -5.0349 -5.0325 -4.9971 -4.9946 -4.9928 -4.9903 -4.8800 -4.8775 4.4046 4.4238 4.9248 5.0617 5.5256 6.0187 6.1825 6.6390 6.6565 6.7333 6.9878 electronvolt
chargesum: -2.0000000
charge: -0.122289 0.132215 0.132226 -0.148099 0.100882 0.101295 -0.148719 0.101135 0.100811 -0.122454 0.132328 0.132326 0.231323 0.216407 0.231365 -0.057448 0.174339 0.174427 0.217894 0.217500 0.264018 0.206763 0.211813 0.206201 0.199046 0.265552 -0.347025 -0.346369 -0.346991 -0.347565 -0.348215 -0.346468 -0.390026 -0.389488 -0.360756 -0.386943 -0.348118 -0.346412 0.143892 0.205422 0.144398 0.173821 0.204280 0.265268 0.218201 0.207392 0.174483 0.199389 0.264670 0.211386 -0.386814 -0.348089 -0.390209 -0.389604 -0.348136 -0.347561 -0.346362 -0.347060 -0.346974 -0.346431 -0.360927 -0.346387 0.217107 0.206530 -0.057213 0.231520 0.216316 0.231213
charge: 0.012135 0.027679 0.027702 -0.018863 0.031472 0.031451 -0.018883 0.031395 0.031485 0.012149 0.027728 0.027707 0.006486 0.034466 0.006103 0.603644 -0.439874 -0.439934 -0.434185 -0.434131 -0.432053 -0.437689 -0.433804 -0.437648 -0.434831 -0.432250 0.299166 0.298485 0.299131 0.296561 0.293536 0.296772 0.283635 0.283926 0.281031 0.249964 0.293518 0.296787 -0.437403 -0.441006 -0.437337 -0.439999 -0.441102 -0.432339 -0.434147 -0.437710 -0.439911 -0.434944 -0.432163 -0.433783 0.250124 0.293528 0.283526 0.284030 0.293585 0.296584 0.298563 0.299190 0.299159 0.296824 0.280814 0.296826 -0.434178 -0.437694 0.603680 0.006833 0.034438 0.006042
qa: -0.1223 0.1322 0.1322 -0.1481 0.1009 0.1013 -0.1487 0.1011 0.1008 -0.1225 0.1323 0.1323 0.2313 0.2164 0.2314 -0.0574 0.1743 0.1744 0.2179 0.2175 0.2640 0.2068 0.2118 0.2062 0.1990 0.2656 -0.3470 -0.3464 -0.3470 -0.3476 -0.3482 -0.3465 -0.3900 -0.3895 -0.3608 -0.3869 -0.3481 -0.3464 0.1439 0.2054 0.1444 0.1738 0.2043 0.2653 0.2182 0.2074 0.1745 0.1994 0.2647 0.2114 -0.3868 -0.3481 -0.3902 -0.3896 -0.3481 -0.3476 -0.3464 -0.3471 -0.3470 -0.3464 -0.3609 -0.3464 0.2171 0.2065 -0.0572 0.2315 0.2163 0.2312
va: 3.8646 0.9999 1.0000 3.8830 1.0237 1.0238 3.8830 1.0237 1.0239 3.8648 1.0000 1.0000 1.0324 0.9801 1.0330 3.6271 3.5473 3.5471 3.4544 3.4544 3.1604 3.5136 3.4540 3.5165 3.4966 3.1572 1.0794 1.0804 1.0794 1.0793 1.0763 1.0809 0.9863 0.9872 1.0546 1.0039 1.0764 1.0810 3.5656 3.4232 3.5646 3.5491 3.4253 3.1570 3.4532 3.5127 3.5488 3.4953 3.1587 3.4548 1.0040 1.0765 0.9859 0.9869 1.0766 1.0793 1.0804 1.0790 1.0794 1.0808 1.0542 1.0810 3.4550 3.5155 3.6272 1.0321 0.9801 1.0329
dispcorr: -0.234034628 hartree
energy: -3267.016031082653
temp: 298.15 k
press: 1.00 atm
zeropoint: 0.38861649 hartree
thermalvibcorrection: 0.04849504 hartree
thermalrotcorrection: 0.00141627 hartree
thermaltrasncorrection: 0.00141627 hartree
thermaltotal: -3266.57608701 hartree
thermalcorr: 0.05132758 hartree
nonthermalcorr: 0.38861649 hartree
totalcorr: 0.43994407 hartree
thermalcorrenthalpy: 0.00094421 hartree
totalenthalpy: -3266.57514280 hartree
totalentropycorr: -0.12868482 hartree
gibbsenthalpy: -3266.70382762 hartree
gibbsminuselec: 0.31220346 hartree
