program: Orca
programVersion: 6.0.0
elementType: C H H C H H C H H H H H N B B B B B B B B B B F F F F F F F F F F F F B B N H H H
charge: 0
multiplicity: 1
keywords: opt freq wB97x-D3BJ def2-TZVPP TightSCF defgrid3 RIJCOSX
keywords: PAL8
frequency: 0.00 0.00 0.00 0.00 0.00 0.00 35.66 71.93 79.73 115.86 129.29 146.25 157.00 168.12 168.67 170.19 171.36 173.15 174.36 176.58 182.66 184.10 185.33 186.45 187.25 190.67 200.51 207.12 226.65 230.66 243.14 254.95 262.70 293.76 315.47 324.04 336.07 365.07 399.66 400.40 401.38 403.32 409.02 423.19 438.92 483.80 487.49 488.48 519.86 554.58 559.85 564.18 668.03 670.77 671.96 675.61 678.50 740.10 742.62 749.82 757.16 790.38 792.70 798.81 801.70 804.29 805.00 814.82 825.86 827.41 828.78 840.10 854.42 858.01 869.64 910.83 938.52 974.31 1025.05 1076.97 1094.66 1115.81 1139.83 1141.19 1180.85 1190.88 1207.34 1213.30 1238.43 1246.84 1251.72 1253.40 1274.29 1292.97 1298.39 1321.78 1357.22 1358.60 1390.17 1413.97 1450.17 1466.42 1486.25 1519.80 1522.43 1575.19 1603.27 1623.41 1673.53 1692.10 1704.58 3073.84 3098.58 3114.17 3131.61 3134.28 3184.96 3192.92 3207.92 3231.93 3268.07 3549.06 3562.89
frequency: 35.66 71.93 79.73 115.86 129.29 146.25 157.00 168.12 168.67 170.19 171.36 173.15 174.36 176.58 182.66 184.10 185.33 186.45 187.25 190.67 200.51 207.12 226.65 230.66 243.14 254.95 262.70 293.76 315.47 324.04 336.07 365.07 399.66 400.40 401.38 403.32 409.02 423.19 438.92 483.80 487.49 488.48 519.86 554.58 559.85 564.18 668.03 670.77 671.96 675.61 678.50 740.10 742.62 749.82 757.16 790.38 792.70 798.81 801.70 804.29 805.00 814.82 825.86 827.41 828.78 840.10 854.42 858.01 869.64 910.83 938.52 974.31 1025.05 1076.97 1094.66 1115.81 1139.83 1141.19 1180.85 1190.88 1207.34 1213.30 1238.43 1246.84 1251.72 1253.40 1274.29 1292.97 1298.39 1321.78 1357.22 1358.60 1390.17 1413.97 1450.17 1466.42 1486.25 1519.80 1522.43 1575.19 1603.27 1623.41 1673.53 1692.10 1704.58 3073.84 3098.58 3114.17 3131.61 3134.28 3184.96 3192.92 3207.92 3231.93 3268.07 3549.06 3562.89
formula: C3H12B12F12N2
InChI: InChI=1/C3H12N2.B12F12/c4-2-1-3-5;13-1-2(14)3(1,15)5(1,17)6(1,18)4(1,2,16)8(2,20)7(2,3,19)9(3,5,21)11(5,6,23)10(4,6,8,22)12(7,8,9,11)24/h1-3H2,4-5H3;
41 atoms
C  0.173581 0.181798 -0.612785
H  0.904701 0.596222 -1.305836
H  -0.625019 -0.256736 -1.206043
C  0.861941 -0.847438 0.286633
H  1.656303 -0.366013 0.864624
H  1.368899 -1.544212 -0.387207
C  0.014167 -1.635257 1.289683
H  -0.489737 -0.987841 1.999333
H  0.665204 -2.301419 1.854371
H  -0.712672 -3.42189 0.445779
H  -1.903037 -2.578167 1.227964
H  -1.420718 -2.090408 -0.237712
N  -1.047377 -2.483808 0.652409
B  -4.304742 -1.561848 0.495282
B  -4.673283 -0.081891 -1.966488
B  -3.669748 0.896743 -0.856438
B  -3.473702 -0.017882 0.644865
B  -6.273599 -0.296247 -1.187307
B  -5.036685 -0.226904 1.438006
B  -4.632418 1.312618 0.592311
B  -5.40111 1.272308 -1.029607
B  -3.487104 -0.861205 -0.913844
B  -6.047093 -1.226087 0.340977
F  -2.625999 1.738112 -1.328418
F  -4.358534 2.474999 1.280344
F  -2.288347 0.047882 1.451388
F  -2.296969 -1.462003 -1.440419
F  -4.468451 -0.02916 -3.322319
F  -5.818044 2.420494 -1.648488
F  -6.996059 -2.085947 0.82339
F  -7.418195 -0.406867 -1.927398
F  -7.378113 1.145649 0.912999
F  -5.183488 -2.813158 -1.799307
F  -3.712464 -2.678556 1.132289
F  -5.094911 -0.298611 2.80871
B  -6.252003 0.568371 0.394349
B  -5.071258 -1.626355 -1.11826
N  -0.446501 1.335348 0.114609
H  -1.124046 1.806825 -0.517479
H  -1.054335 0.996847 0.881339
H  0.235293 1.999689 0.469703
totalener: -1729.19109278671340 hartree
nucrepener: 3184.75930529010202 hartree
electener: -4913.95040995188992 hartree
oneelecener: -8737.40987307796422 hartree
twoeener: 3823.45946312607430 hartree
kineticenergy: 1722.85831848932094 hartree
exchangeener: -139.420287111350 hartree
correlationener: -9.334132565740 hartree
xcener: -148.754419677090 hartree
energy: -674.7984 -674.6402 -674.0911 -673.8408 -672.6490 -672.4983 -672.4542 -672.4528 -672.2047 -672.1616 -672.0252 -671.9918 -397.2156 -397.1686 -283.7297 -283.6307 -282.8805 -187.3927 -187.3830 -187.2777 -187.1724 -186.8365 -186.7767 -186.7671 -186.7665 -186.6165 -186.6038 -186.4843 -186.4504 -37.0893 -36.8907 -36.3282 -36.0762 -35.0247 -34.8900 -34.8752 -34.8100 -34.6197 -34.5737 -34.4322 -34.3766 -33.0130 -32.8200 -28.0677 -25.5802 -25.2041 -23.1148 -21.7352 -21.4474 -21.1959 -21.0568 -20.9411 -20.7062 -20.6495 -19.5618 -18.6918 -18.5281 -18.1141 -18.0141 -17.9264 -17.8274 -17.6755 -17.4604 -17.3052 -16.7662 -16.6290 -16.6133 -16.4587 -16.2687 -16.1809 -16.1179 -15.8799 -15.8332 -15.8217 -15.7516 -15.7010 -15.5103 -15.4223 -15.3282 -15.2689 -15.1981 -15.0350 -15.0064 -14.9168 -14.8587 -14.6889 -14.4968 -14.1088 -14.0321 -13.9394 -13.6836 -13.6124 -13.5700 -13.5127 -13.2415 -13.2093 -13.1643 -12.1035 -12.0577 -12.0410 -11.8256 -11.7610 -8.9403 -8.8713 -8.8446 -8.7617 -0.0657 0.6072 0.7220 1.6038 1.6726 2.1154 2.2472 2.4877 2.9230 3.2520 3.4586 electronvolt
chargesum: 0.0000000
charge: -0.147834 0.160664 0.156781 -0.178848 0.107489 0.116042 -0.143183 0.143187 0.151683 0.221309 0.250251 0.217738 -0.048443 0.181197 0.181850 0.216261 0.295401 0.237258 0.172944 0.145896 0.204768 0.244190 0.221003 -0.387694 -0.331645 -0.432468 -0.375632 -0.324450 -0.321689 -0.320852 -0.319587 -0.319789 -0.325893 -0.381343 -0.326732 0.228602 0.192181 -0.051088 0.252665 0.222559 0.215252
charge: 0.020403 0.032401 0.024542 -0.022109 0.036352 0.039672 0.012439 0.019177 0.029631 0.040759 0.026729 -0.021970 0.605810 -0.420785 -0.441141 -0.414746 -0.443036 -0.432487 -0.442770 -0.440815 -0.435989 -0.429867 -0.433687 0.289842 0.305671 0.287677 0.303729 0.319773 0.326077 0.327363 0.331490 0.330368 0.317469 0.278793 0.316790 -0.432009 -0.439220 0.606107 0.006473 -0.017594 0.032692
qa: -0.1478 0.1607 0.1568 -0.1788 0.1075 0.1160 -0.1432 0.1432 0.1517 0.2213 0.2503 0.2177 -0.0484 0.1812 0.1819 0.2163 0.2954 0.2373 0.1729 0.1459 0.2048 0.2442 0.2210 -0.3877 -0.3316 -0.4325 -0.3756 -0.3245 -0.3217 -0.3209 -0.3196 -0.3198 -0.3259 -0.3813 -0.3267 0.2286 0.1922 -0.0511 0.2527 0.2226 0.2153
va: 3.8088 0.9982 1.0236 3.8965 1.0104 1.0074 3.8473 1.0075 0.9975 0.9777 1.0165 1.0820 3.5806 3.4843 3.6514 3.3582 3.1062 3.5214 3.5665 3.6295 3.5659 3.2151 3.5816 0.9931 1.0972 0.9145 1.0016 1.1129 1.1192 1.1205 1.1233 1.1212 1.1096 1.0042 1.1080 3.4994 3.6107 3.5547 1.0222 1.0460 0.9790
dispcorr: -0.129606158 hartree
energy: -1729.325778577694
temp: 298.15 k
press: 1.00 atm
zeropoint: 0.26583961 hartree
thermalvibcorrection: 0.02447573 hartree
thermalrotcorrection: 0.00141627 hartree
thermaltrasncorrection: 0.00141627 hartree
thermaltotal: -1729.03263070 hartree
thermalcorr: 0.02730827 hartree
nonthermalcorr: 0.26583961 hartree
totalcorr: 0.29314788 hartree
thermalcorrenthalpy: 0.00094421 hartree
totalenthalpy: -1729.03168649 hartree
totalentropycorr: -0.08002248 hartree
gibbsenthalpy: -1729.11170897 hartree
gibbsminuselec: 0.21406960 hartree
