program: Orca
programVersion: 6.0.0
elementType: C H H C H H C H H H H H N B B B B B B B B B B F F F F F F F F F F F F B B N H H
charge: -1
multiplicity: 1
keywords: opt freq wB97x-D3BJ def2-TZVPP TightSCF defgrid3 RIJCOSX
keywords: PAL8
frequency: 0.00 0.00 0.00 0.00 0.00 0.00 17.36 28.15 53.12 74.88 86.02 129.84 133.20 167.51 169.91 170.45 171.86 172.05 173.79 174.58 175.69 177.10 182.69 183.87 186.19 186.62 187.73 188.62 191.89 194.11 208.90 230.62 235.78 240.49 270.74 291.58 322.77 379.44 399.14 399.38 399.66 401.06 403.37 411.97 435.38 453.35 483.56 484.64 487.15 557.21 562.54 564.32 670.50 673.26 675.82 677.94 679.17 743.32 747.54 749.40 754.71 800.39 804.71 809.31 810.64 812.59 814.64 827.02 828.65 832.62 839.13 845.35 847.35 852.80 854.35 886.89 954.62 1001.01 1053.62 1078.30 1082.65 1121.74 1150.43 1162.84 1182.44 1201.08 1220.44 1228.98 1229.55 1237.88 1239.95 1268.27 1270.89 1285.68 1286.42 1336.24 1346.72 1349.26 1360.42 1402.16 1413.29 1450.33 1501.91 1511.16 1526.89 1596.28 1653.70 1675.44 1704.05 3046.76 3077.58 3081.99 3091.47 3121.59 3146.71 3198.04 3221.10 3540.64 3573.00 3613.67
frequency: 17.36 28.15 53.12 74.88 86.02 129.84 133.20 167.51 169.91 170.45 171.86 172.05 173.79 174.58 175.69 177.10 182.69 183.87 186.19 186.62 187.73 188.62 191.89 194.11 208.90 230.62 235.78 240.49 270.74 291.58 322.77 379.44 399.14 399.38 399.66 401.06 403.37 411.97 435.38 453.35 483.56 484.64 487.15 557.21 562.54 564.32 670.50 673.26 675.82 677.94 679.17 743.32 747.54 749.40 754.71 800.39 804.71 809.31 810.64 812.59 814.64 827.02 828.65 832.62 839.13 845.35 847.35 852.80 854.35 886.89 954.62 1001.01 1053.62 1078.30 1082.65 1121.74 1150.43 1162.84 1182.44 1201.08 1220.44 1228.98 1229.55 1237.88 1239.95 1268.27 1270.89 1285.68 1286.42 1336.24 1346.72 1349.26 1360.42 1402.16 1413.29 1450.33 1501.91 1511.16 1526.89 1596.28 1653.70 1675.44 1704.05 3046.76 3077.58 3081.99 3091.47 3121.59 3146.71 3198.04 3221.10 3540.64 3573.00 3613.67
formula: C3H11B12F12N2
InChI: InChI=1/C3H11N2.B12F12/c4-2-1-3-5;13-1-2(14)3(1,15)5(1,17)6(1,18)4(1,2,16)8(2,20)7(2,3,19)9(3,5,21)11(5,6,23)10(4,6,8,22)12(7,8,9,11)24/h1-4H2,5H3;
40 atoms
C  5.943828 0.522834 0.000639
H  6.458581 0.118642 0.878803
H  6.462223 0.116065 -0.874192
C  4.486952 0.057954 -0.00156
H  3.970144 0.457848 -0.878318
H  3.966893 0.459989 0.872304
C  4.377191 -1.460421 0.000226
H  4.84577 -1.892652 0.886231
H  4.845917 -1.89495 -0.884571
H  2.450857 -1.442561 -0.810895
H  2.771526 -2.858222 0.000554
H  2.4518 -1.442459 0.812587
N  2.94459 -1.857526 0.000608
B  -1.129616 -0.810857 -1.451728
B  -1.129618 -0.810425 1.452318
B  -2.460776 0.245876 0.897451
B  -2.460775 0.245556 -0.897263
B  0.384153 -0.073247 0.889137
B  -0.921892 0.97712 -1.45341
B  -1.742435 1.628649 -0.000123
B  -0.921905 0.977564 1.453343
B  -2.081094 -1.263563 0.000373
B  0.384209 -0.07352 -0.888806
F  -3.62572 0.3810 1.620587
F  -2.328108 2.876079 -0.000311
F  -3.625735 0.380425 -1.620417
F  -2.924189 -2.354641 0.000541
F  -1.162667 -1.540715 2.624862
F  -0.8111 1.686775 2.631475
F  1.589389 -0.254012 -1.627246
F  1.589348 -0.253115 1.627745
F  0.941056 2.475261 -0.000202
F  0.368766 -2.680841 0.00048
F  -1.162568 -1.541651 -2.623964
F  -0.811166 1.685987 -2.631751
B  0.036622 1.426699 -0.000102
B  -0.311478 -1.447805 0.000412
N  6.123091 1.969737 -0.001105
H  5.669491 2.378398 0.8071
H  5.673029 2.376066 -0.812454
totalener: -1728.73983021201434 hartree
nucrepener: 2996.99702227681337 hartree
electener: -4725.73686880004334 hartree
oneelecener: -8386.54312320659483 hartree
twoeener: 3660.80625440655149 hartree
kineticenergy: 1722.49266051132327 hartree
exchangeener: -139.348308882545 hartree
correlationener: -9.322174959229 hartree
xcener: -148.670483841774 hartree
energy: -671.1302 -671.1292 -670.5726 -669.8554 -669.7124 -669.7124 -669.6029 -669.6026 -669.5368 -669.4202 -669.3937 -669.3936 -393.6444 -390.3638 -280.3158 -279.1562 -278.5201 -184.1772 -184.1704 -184.0871 -183.9095 -183.8165 -183.8163 -183.7659 -183.7655 -183.7299 -183.6354 -183.6123 -183.6073 -33.4370 -33.3283 -32.8258 -32.1959 -32.0849 -32.0700 -31.9506 -31.9442 -31.8943 -31.8007 -31.7243 -31.7104 -29.5045 -26.6143 -23.8890 -22.1181 -20.9280 -19.1858 -17.9419 -17.9311 -17.8446 -17.6317 -17.4825 -15.8193 -15.7874 -15.0556 -14.9649 -14.7448 -14.5753 -14.5675 -14.2719 -14.1601 -13.6985 -13.6215 -13.5560 -13.3439 -13.1287 -13.0753 -12.9986 -12.9730 -12.8839 -12.8627 -12.7635 -12.6928 -12.5047 -12.3876 -12.3186 -12.2550 -12.2429 -12.2186 -11.9429 -11.8388 -11.7997 -11.7257 -11.4250 -11.2970 -11.1747 -11.0202 -10.9004 -10.8723 -10.8409 -10.8282 -10.7780 -10.7628 -10.5318 -10.4852 -10.4800 -9.0781 -9.0241 -8.9834 -8.8788 -8.8594 -8.3636 -5.9378 -5.8943 -5.8926 -5.7763 3.3945 3.8639 4.1602 4.7648 4.8401 5.5454 5.8508 5.9666 6.1929 6.1967 6.4872 electronvolt
chargesum: -1.0000000
charge: -0.028411 0.064516 0.064493 -0.129952 0.087461 0.087447 -0.114921 0.111041 0.111040 0.230011 0.213797 0.230013 -0.063562 0.169282 0.169398 0.219078 0.219290 0.257659 0.205023 0.214929 0.205553 0.196258 0.257865 -0.343822 -0.343624 -0.343837 -0.345050 -0.347815 -0.345328 -0.383310 -0.383463 -0.355369 -0.393864 -0.347811 -0.345314 0.145340 0.221148 -0.348789 0.141837 0.141764
charge: -0.097124 0.012659 0.012645 -0.036138 0.027376 0.027443 -0.001571 0.020828 0.020806 0.000393 0.031637 0.000459 0.602201 -0.440225 -0.440216 -0.434134 -0.434133 -0.428253 -0.437965 -0.433784 -0.437984 -0.435593 -0.428219 0.302929 0.301957 0.302931 0.299350 0.293621 0.298369 0.284607 0.284471 0.285357 0.246798 0.293618 0.298364 -0.438856 -0.440562 0.224563 -0.054290 -0.054332
qa: -0.0284 0.0645 0.0645 -0.1300 0.0875 0.0874 -0.1149 0.1110 0.1110 0.2300 0.2138 0.2300 -0.0636 0.1693 0.1694 0.2191 0.2193 0.2577 0.2050 0.2149 0.2056 0.1963 0.2579 -0.3438 -0.3436 -0.3438 -0.3450 -0.3478 -0.3453 -0.3833 -0.3835 -0.3554 -0.3939 -0.3478 -0.3453 0.1453 0.2211 -0.3488 0.1418 0.1418
va: 4.0044 0.9977 0.9977 3.8539 1.0288 1.0289 3.8795 1.0008 1.0008 1.0409 0.9826 1.0407 3.6297 3.5513 3.5509 3.4543 3.4541 3.1816 3.5188 3.4507 3.5187 3.5086 3.1811 1.0842 1.0844 1.0842 1.0830 1.0768 1.0826 0.9961 0.9959 1.0628 0.9917 1.0768 1.0827 3.5736 3.3925 3.0638 1.0267 1.0267
dispcorr: -0.123112853 hartree
energy: -1728.863178498978
temp: 298.15 k
press: 1.00 atm
zeropoint: 0.25022380 hartree
thermalvibcorrection: 0.02542481 hartree
thermalrotcorrection: 0.00141627 hartree
thermaltrasncorrection: 0.00141627 hartree
thermaltotal: -1728.58469734 hartree
thermalcorr: 0.02825736 hartree
nonthermalcorr: 0.25022380 hartree
totalcorr: 0.27848116 hartree
thermalcorrenthalpy: 0.00094421 hartree
totalenthalpy: -1728.58375313 hartree
totalentropycorr: -0.08287345 hartree
gibbsenthalpy: -1728.66662659 hartree
gibbsminuselec: 0.19655191 hartree
