program: Orca
programVersion: 6.0.0
elementType: C H H N H H C H H N H H
charge: 0
multiplicity: 1
keywords: opt freq wB97x-D3BJ def2-TZVPPD TightSCF defgrid3 RIJCOSX
keywords: PAL8
frequency: 0.00 0.00 0.00 0.00 0.00 0.00 142.72 219.10 229.27 301.50 480.20 796.92 828.20 854.19 967.19 1040.47 1098.17 1124.32 1186.06 1241.21 1334.57 1342.75 1394.47 1462.24 1515.50 1528.44 1661.27 1666.23 2979.40 2985.91 3102.24 3116.60 3552.53 3553.07 3632.35 3632.84
frequency: 142.72 219.10 229.27 301.50 480.20 796.92 828.20 854.19 967.19 1040.47 1098.17 1124.32 1186.06 1241.21 1334.57 1342.75 1394.47 1462.24 1515.50 1528.44 1661.27 1666.23 2979.40 2985.91 3102.24 3116.60 3552.53 3553.07 3632.35 3632.84
formula: C2H8N2
InChI: InChI=1/C2H8N2/c3-1-2-4/h1-4H2
12 atoms
C  -2.509263 0.857581 -0.121635
H  -1.851911 0.023779 -0.414218
H  -2.446019 1.604924 -0.915242
N  -3.908013 0.465002 0.043123
H  -4.305541 0.163739 -0.836135
H  -3.990348 -0.310713 0.688097
C  -1.980989 1.472735 1.166119
H  -2.152375 0.767298 1.994346
H  -2.563438 2.369442 1.387518
N  -0.577973 1.851842 1.006012
H  -0.249153 2.36998 1.809334
H  0.008603 1.031332 0.920977
totalener: -190.67525955104423 hartree
nucrepener: 132.11914876926866 hartree
electener: -322.79440870886600 hartree
oneelecener: -518.14250754932095 hartree
twoeener: 195.34809884045495 hartree
kineticenergy: 189.73299676168085 hartree
exchangeener: -17.584366757035 hartree
correlationener: -1.372366315792 hartree
xcener: -18.956733072826 hartree
energy: -391.5869 -391.5865 -279.9586 -279.9531 -27.9739 -27.2145 -22.6596 -19.6455 -16.8970 -16.2893 -15.3378 -15.0848 -13.6579 -12.4912 -12.4823 -9.5793 -9.3883 1.7460 1.9984 2.4904 3.0880 3.3511 4.0428 4.2715 4.4264 4.7159 5.2633 5.6341 electronvolt
chargesum: -0.0000000
charge: 0.037498 0.043237 0.073707 -0.393373 0.126853 0.112065 0.037386 0.043316 0.073881 -0.393625 0.127036 0.112019
charge: -0.112318 0.012063 0.018096 0.303595 -0.112195 -0.109332 -0.112293 0.012066 0.018142 0.303625 -0.112190 -0.109260
qa: 0.0375 0.0432 0.0737 -0.3934 0.1269 0.1121 0.0374 0.0433 0.0739 -0.3936 0.1270 0.1120
va: 3.9335 1.2046 1.0521 2.8322 1.0259 1.0433 3.9321 1.2046 1.0515 2.8317 1.0257 1.0434
dispcorr: -0.012382431 hartree
energy: -190.687641962947
temp: 298.15 k
press: 1.00 atm
zeropoint: 0.11156174 hartree
thermalvibcorrection: 0.00277482 hartree
thermalrotcorrection: 0.00141627 hartree
thermaltrasncorrection: 0.00141627 hartree
thermaltotal: -190.57047286 hartree
thermalcorr: 0.00560737 hartree
nonthermalcorr: 0.11156174 hartree
totalcorr: 0.11716910 hartree
thermalcorrenthalpy: 0.00094421 hartree
totalenthalpy: -190.56952865 hartree
totalentropycorr: -0.03431449 hartree
gibbsenthalpy: -190.60384314 hartree
gibbsminuselec: 0.08379882 hartree
