program: Orca
programVersion: 6.0.0
elementType: C C C C C C C C C C C N N H H H H H H H H H H H H H H H H H H H H H H H H H H H
charge: 1
multiplicity: 1
keywords: opt freq wB97x-D3BJ def2-TZVPPD TightSCF defgrid3 RIJCOSX
keywords: PAL8
frequency: 0.00 0.00 0.00 0.00 0.00 0.00 61.64 66.77 73.35 94.08 106.46 118.34 133.54 180.08 189.55 200.56 233.49 251.12 293.26 310.45 332.00 342.26 353.81 407.07 424.76 463.00 492.73 526.22 566.46 737.06 742.19 753.57 796.75 818.08 856.49 860.40 877.64 914.12 936.90 948.53 967.95 988.84 1031.06 1033.38 1050.33 1059.87 1062.07 1080.24 1092.19 1101.44 1110.10 1121.80 1129.05 1142.78 1167.37 1176.92 1216.29 1234.07 1258.05 1274.11 1282.83 1299.30 1316.77 1332.38 1341.52 1346.66 1352.09 1354.70 1360.70 1381.64 1391.06 1396.15 1397.05 1416.41 1419.47 1424.10 1428.18 1439.33 1491.80 1496.95 1497.84 1500.82 1505.89 1509.58 1511.02 1513.74 1515.17 1520.17 1527.27 1600.37 1658.49 1687.03 1737.74 2150.58 3022.51 3033.91 3049.93 3052.49 3061.33 3062.55 3063.44 3068.01 3073.34 3083.99 3087.82 3093.03 3099.51 3103.42 3111.52 3113.70 3116.84 3120.51 3124.63 3130.07 3134.50 3161.06 3492.10 3522.75 3555.28 3585.37
frequency: 61.64 66.77 73.35 94.08 106.46 118.34 133.54 180.08 189.55 200.56 233.49 251.12 293.26 310.45 332.00 342.26 353.81 407.07 424.76 463.00 492.73 526.22 566.46 737.06 742.19 753.57 796.75 818.08 856.49 860.40 877.64 914.12 936.90 948.53 967.95 988.84 1031.06 1033.38 1050.33 1059.87 1062.07 1080.24 1092.19 1101.44 1110.10 1121.80 1129.05 1142.78 1167.37 1176.92 1216.29 1234.07 1258.05 1274.11 1282.83 1299.30 1316.77 1332.38 1341.52 1346.66 1352.09 1354.70 1360.70 1381.64 1391.06 1396.15 1397.05 1416.41 1419.47 1424.10 1428.18 1439.33 1491.80 1496.95 1497.84 1500.82 1505.89 1509.58 1511.02 1513.74 1515.17 1520.17 1527.27 1600.37 1658.49 1687.03 1737.74 2150.58 3022.51 3033.91 3049.93 3052.49 3061.33 3062.55 3063.44 3068.01 3073.34 3083.99 3087.82 3093.03 3099.51 3103.42 3111.52 3113.70 3116.84 3120.51 3124.63 3130.07 3134.50 3161.06 3492.10 3522.75 3555.28 3585.37
formula: C11H27N2
InChI: InChI=1/C11H27N2/c12-10-8-6-4-2-1-3-5-7-9-11-13/h1-12H2,13H3
40 atoms
C  -6.219822 3.002467 -0.285033
C  -6.502961 1.512275 -0.165792
C  -5.27615 0.645001 -0.424667
C  -5.525632 -0.858347 -0.31748
C  -4.229613 -1.659354 -0.483984
C  -3.294776 -1.564567 0.734021
C  -1.793353 -1.72251 0.433661
C  -1.056614 -0.390226 0.25835
C  -1.456537 0.396269 -0.994068
C  -0.961385 1.855361 -1.026487
C  -2.0755 2.853273 -0.720075
N  -5.284567 3.479857 0.795334
N  -2.65787 2.711956 0.641245
H  -5.745039 3.244314 -1.236681
H  -7.135786 3.58688 -0.197475
H  -6.925547 1.297392 0.822787
H  -7.289224 1.276031 -0.887095
H  -4.885587 0.872664 -1.422842
H  -4.491519 0.915828 0.284174
H  -5.979707 -1.089165 0.652732
H  -6.250304 -1.156982 -1.080035
H  -4.472192 -2.709534 -0.660843
H  -3.717917 -1.319593 -1.388588
H  -3.442683 -0.60716 1.249033
H  -3.604506 -2.32326 1.456614
H  -1.656643 -2.342776 -0.458202
H  -1.317396 -2.263667 1.254271
H  -1.223528 0.213304 1.160675
H  0.022412 -0.567336 0.227691
H  -1.0834 -0.14257 -1.867845
H  -2.543894 0.398441 -1.098326
H  -0.568222 2.100908 -2.015454
H  -0.133685 1.99592 -0.323697
H  -1.724141 3.8813 -0.82463
H  -2.883374 2.71349 -1.444694
H  -5.26819 4.497731 0.82224
H  -5.617923 3.164602 1.705325
H  -2.625582 1.732007 0.904265
H  -2.05678 3.18311 1.309643
H  -4.236744 3.151919 0.690509
totalener: -545.18706688522468 hartree
nucrepener: 914.88136830119493 hartree
electener: -1460.06843864673715 hartree
oneelecener: -2535.54467605970285 hartree
twoeener: 1075.47623741296570 hartree
kineticenergy: 542.37590708452490 hartree
exchangeener: -52.534798835514 hartree
correlationener: -4.262411687524 hartree
xcener: -56.797210523037 hartree
energy: -398.9480 -396.2656 -285.1279 -283.8386 -283.4620 -282.9306 -282.5116 -282.3710 -282.2734 -282.1626 -282.0570 -282.0505 -281.9063 -34.5807 -32.0844 -29.4578 -28.6757 -28.1084 -27.2540 -26.3345 -25.2847 -24.3234 -23.5683 -22.9749 -22.7160 -22.4742 -21.9523 -21.7005 -20.9815 -20.5532 -19.5381 -19.0917 -18.8926 -18.7485 -18.2643 -18.0431 -17.8414 -17.5558 -17.2738 -17.0188 -16.8205 -16.3608 -16.0810 -15.7162 -15.5284 -15.4609 -15.3124 -14.7228 -14.6274 -14.4422 -14.0006 -13.8622 -13.7875 -2.2894 -1.5144 -1.2345 -0.9874 -0.6388 -0.5700 -0.3993 -0.3209 -0.2377 0.0503 0.2674 electronvolt
chargesum: 1.0000000
charge: -0.208529 -0.167666 0.840955 -0.277461 -0.121831 -0.025352 -0.258835 0.009257 0.717955 -0.395014 0.054781 0.152867 -0.178980 0.064628 0.124692 0.063466 0.058339 -0.012847 -0.565712 0.118232 0.097692 0.093052 0.008535 -0.074212 0.155440 0.113242 0.077732 -0.016006 0.058739 0.218785 -0.725154 0.070155 0.082960 0.116382 -0.000076 0.265881 0.249361 -0.086361 0.217437 0.083472
charge: 0.055521 0.004809 -0.039350 -0.007038 -0.012973 -0.010958 -0.004077 -0.024216 -0.010590 0.008467 -0.029282 0.536702 0.370417 0.037349 0.034360 0.031109 0.034578 0.028623 -0.024008 0.028693 0.024864 0.023214 0.006414 -0.002478 0.020664 0.024749 0.015379 0.006218 0.023767 0.028797 -0.023229 0.019924 0.024154 0.025475 0.013814 0.015087 0.017117 -0.107037 -0.053917 -0.111112
qa: -0.2085 -0.1677 0.8410 -0.2775 -0.1218 -0.0254 -0.2588 0.0093 0.7180 -0.3950 0.0548 0.1529 -0.1790 0.0646 0.1247 0.0635 0.0583 -0.0128 -0.5657 0.1182 0.0977 0.0931 0.0085 -0.0742 0.1554 0.1132 0.0777 -0.0160 0.0587 0.2188 -0.7252 0.0702 0.0830 0.1164 -0.0001 0.2659 0.2494 -0.0864 0.2174 0.0835
va: 4.0249 3.8531 3.6557 4.4180 4.2378 4.0438 4.3458 4.0226 3.5800 4.4291 4.0496 3.7147 3.2028 1.0590 1.0001 1.0024 1.0339 0.9272 1.1472 0.9980 1.0388 0.9882 0.9935 1.0553 0.9283 0.9640 1.0469 1.0419 1.0373 0.8009 1.3151 1.0448 1.0227 0.9884 1.1254 0.8813 0.9030 1.4614 0.9117 1.2909
dispcorr: -0.067538492 hartree
energy: -545.254548898011
temp: 298.15 k
press: 1.00 atm
zeropoint: 0.38726365 hartree
thermalvibcorrection: 0.01284398 hartree
thermalrotcorrection: 0.00141627 hartree
thermaltrasncorrection: 0.00141627 hartree
thermaltotal: -544.85160872 hartree
thermalcorr: 0.01567653 hartree
nonthermalcorr: 0.38726365 hartree
totalcorr: 0.40294017 hartree
thermalcorrenthalpy: 0.00094421 hartree
totalenthalpy: -544.85066451 hartree
totalentropycorr: -0.05741292 hartree
gibbsenthalpy: -544.90807743 hartree
gibbsminuselec: 0.34647147 hartree
