program: Orca
programVersion: 6.0.0
elementType: C H H C H H C H H C H H C H H N H H N H H H
charge: 1
multiplicity: 1
keywords: opt freq wB97x-D3BJ def2-TZVPPD TightSCF defgrid3 RIJCOSX
keywords: PAL8
frequency: 0.00 0.00 0.00 0.00 0.00 0.00 85.59 187.17 232.20 249.84 266.10 321.27 365.87 405.89 442.19 546.79 599.45 756.58 794.28 816.79 875.59 940.53 967.47 978.71 1024.17 1028.77 1097.75 1107.33 1114.59 1148.43 1162.79 1211.46 1261.48 1310.49 1329.78 1342.84 1348.74 1393.90 1421.23 1427.55 1438.64 1444.70 1493.26 1500.45 1509.26 1516.65 1548.95 1602.80 1653.23 1677.27 1734.20 2174.90 3056.60 3069.01 3071.07 3082.51 3109.78 3115.94 3119.77 3123.23 3129.53 3178.66 3499.49 3520.00 3564.36 3587.09
frequency: 85.59 187.17 232.20 249.84 266.10 321.27 365.87 405.89 442.19 546.79 599.45 756.58 794.28 816.79 875.59 940.53 967.47 978.71 1024.17 1028.77 1097.75 1107.33 1114.59 1148.43 1162.79 1211.46 1261.48 1310.49 1329.78 1342.84 1348.74 1393.90 1421.23 1427.55 1438.64 1444.70 1493.26 1500.45 1509.26 1516.65 1548.95 1602.80 1653.23 1677.27 1734.20 2174.90 3056.60 3069.01 3071.07 3082.51 3109.78 3115.94 3119.77 3123.23 3129.53 3178.66 3499.49 3520.00 3564.36 3587.09
formula: C5H15N2
InChI: InChI=1/C5H15N2/c6-4-2-1-3-5-7/h1-6H2,7H3
22 atoms
C  -4.761673 1.791344 -0.373689
H  -4.35369 2.588011 0.244888
H  -4.631414 2.075361 -1.417594
C  -4.106197 0.440945 -0.097326
H  -4.325511 -0.223392 -0.938684
H  -3.025303 0.600482 -0.114201
C  -4.509901 -0.28326 1.193097
H  -4.048823 -1.271888 1.148331
H  -5.587167 -0.483975 1.189807
C  -4.104377 0.341346 2.532682
H  -4.332721 -0.39181 3.311989
H  -3.020637 0.481346 2.562529
C  -4.76185 1.666766 2.919903
H  -4.57025 1.856715 3.97877
H  -4.3237 2.502887 2.372157
N  -6.233236 1.747104 -0.0776
H  -6.700646 2.588527 -0.408376
H  -6.674798 0.950574 -0.533329
N  -6.217809 1.660914 2.635185
H  -6.651972 0.862591 3.088809
H  -6.650201 2.480511 3.049077
H  -6.36311 1.674023 1.012132
totalener: -309.10821894320554 hartree
nucrepener: 354.49508756871825 hartree
electener: -663.60330679878439 hartree
oneelecener: -1108.04904732666432 hartree
twoeener: 444.44574052787993 hartree
kineticenergy: 307.54000173471849 hartree
exchangeener: -29.293450943814 hartree
correlationener: -2.342227106707 hartree
xcener: -31.635678050522 hartree
energy: -399.1537 -396.6491 -285.3478 -284.2911 -283.7767 -283.4736 -283.2939 -34.8486 -32.4556 -29.6773 -28.0478 -26.5255 -24.5585 -23.3240 -23.0856 -22.7382 -21.2042 -20.6231 -19.8737 -19.6794 -19.0044 -18.9248 -17.6879 -17.2912 -17.2176 -15.9976 -15.8598 -15.7039 -14.5400 -2.4766 -1.6094 -1.5105 -1.3057 -0.6462 -0.5129 -0.4774 -0.4210 -0.1362 0.3785 0.5467 electronvolt
chargesum: 1.0000000
charge: -0.111703 0.064961 0.083979 -0.083151 0.087024 0.107340 -0.043185 0.028317 0.021303 -0.050089 0.087840 0.096988 -0.091970 0.084394 0.021541 0.043478 0.242113 0.231399 -0.309469 0.168613 0.171531 0.148746
charge: 0.059384 0.022039 0.036575 0.018733 0.025602 0.032687 -0.012988 0.024626 0.006988 0.009080 0.023638 0.028159 -0.025887 0.026514 0.010450 0.536078 0.018081 0.018952 0.365320 -0.052985 -0.056742 -0.114304
qa: -0.1117 0.0650 0.0840 -0.0832 0.0870 0.1073 -0.0432 0.0283 0.0213 -0.0501 0.0878 0.0970 -0.0920 0.0844 0.0215 0.0435 0.2421 0.2314 -0.3095 0.1686 0.1715 0.1487
va: 4.1797 1.0127 1.0554 3.9605 1.0553 1.0461 4.2849 1.0917 0.9914 4.0136 1.0406 1.0499 4.1455 1.0725 1.0284 3.7305 0.9181 0.9344 3.2236 1.0146 1.0111 1.2171
dispcorr: -0.032452227 hartree
energy: -309.140670382163
temp: 298.15 k
press: 1.00 atm
zeropoint: 0.21434136 hartree
thermalvibcorrection: 0.00521923 hartree
thermalrotcorrection: 0.00141627 hartree
thermaltrasncorrection: 0.00141627 hartree
thermaltotal: -308.91827724 hartree
thermalcorr: 0.00805178 hartree
nonthermalcorr: 0.21434136 hartree
totalcorr: 0.22239314 hartree
thermalcorrenthalpy: 0.00094421 hartree
totalenthalpy: -308.91733303 hartree
totalentropycorr: -0.04064364 hartree
gibbsenthalpy: -308.95797667 hartree
gibbsminuselec: 0.18269371 hartree
