program: Orca
programVersion: 6.0.0
elementType: C C C H H H H H H H H H H N N H
charge: 1
multiplicity: 1
keywords: opt freq wB97x-D3BJ def2-TZVPPD TightSCF defgrid3 RIJCOSX
keywords: PAL8
frequency: 0.00 0.00 0.00 0.00 0.00 0.00 126.42 281.02 334.41 351.98 376.29 507.00 530.27 836.27 862.82 871.36 936.31 965.72 1037.77 1058.84 1073.92 1115.85 1164.53 1250.93 1306.73 1338.90 1361.18 1386.50 1430.84 1439.59 1489.63 1506.47 1523.96 1539.23 1643.40 1664.39 1721.88 2504.56 3065.65 3083.53 3112.27 3130.88 3138.83 3172.41 3503.33 3536.03 3568.40 3606.78
frequency: 126.42 281.02 334.41 351.98 376.29 507.00 530.27 836.27 862.82 871.36 936.31 965.72 1037.77 1058.84 1073.92 1115.85 1164.53 1250.93 1306.73 1338.90 1361.18 1386.50 1430.84 1439.59 1489.63 1506.47 1523.96 1539.23 1643.40 1664.39 1721.88 2504.56 3065.65 3083.53 3112.27 3130.88 3138.83 3172.41 3503.33 3536.03 3568.40 3606.78
formula: C3H11N2
InChI: InChI=1/C3H11N2/c4-2-1-3-5/h1-4H2,5H3
16 atoms
C  0.380573 1.232041 0.991531
C  -1.141909 1.22536 0.922343
C  -1.729796 -0.186035 0.964754
H  1.890952 0.207169 -0.085504
H  -1.84571 -0.801856 -1.006598
H  -1.336335 -1.972934 -0.008475
H  0.733981 0.675254 1.860021
H  0.793226 2.238851 1.033302
H  -1.5186 1.798901 1.771027
H  -1.478223 1.751533 0.022121
H  -1.392693 -0.692481 1.871907
H  -2.819596 -0.134777 1.009549
H  0.929035 1.143852 -1.038432
N  0.936936 0.532818 -0.223869
N  -1.260217 -0.980349 -0.197354
H  0.253694 -0.284962 -0.402719
totalener: -230.25618278148821 hartree
nucrepener: 202.65649726943585 hartree
electener: -432.91268024181096 hartree
oneelecener: -703.32803829212128 hartree
twoeener: 270.41535805031032 hartree
kineticenergy: 228.12077987957116 hartree
exchangeener: -21.283465855739 hartree
correlationener: -1.683082017459 hartree
xcener: -22.966547873198 hartree
energy: -399.5564 -396.7839 -285.7528 -284.7415 -284.2394 -35.2665 -32.6250 -29.5368 -26.6799 -24.5312 -23.6001 -23.3490 -21.6126 -20.7415 -20.1669 -19.7441 -18.3715 -17.9681 -17.5584 -16.8473 -14.7658 -2.6375 -1.6590 -1.6378 -1.5180 -0.7001 -0.4996 -0.4319 -0.1507 -0.0802 0.4129 0.7655 electronvolt
chargesum: 1.0000000
charge: -0.224789 0.096898 -0.151074 0.240223 0.166365 0.166484 0.132144 0.086680 0.082609 0.074424 0.123823 0.072141 0.229285 -0.002858 -0.357656 0.265302
charge: 0.068625 0.014875 -0.019975 0.021373 -0.058588 -0.060151 0.041543 0.037189 0.031784 0.029999 0.032360 0.027764 0.023555 0.547123 0.355878 -0.093354
qa: -0.2248 0.0969 -0.1511 0.2402 0.1664 0.1665 0.1321 0.0867 0.0826 0.0744 0.1238 0.0721 0.2293 -0.0029 -0.3577 0.2653
va: 4.1645 3.8362 4.0856 0.9289 1.0284 1.0220 1.0004 1.0800 1.0681 1.0375 1.0170 1.1278 0.9481 3.7764 3.1588 1.0683
dispcorr: -0.020151465 hartree
energy: -230.431074994278
temp: 298.15 k
press: 1.00 atm
zeropoint: 0.15595671 hartree
thermalvibcorrection: 0.00312327 hartree
thermalrotcorrection: 0.00141627 hartree
thermaltrasncorrection: 0.00141627 hartree
thermaltotal: -230.26916247 hartree
thermalcorr: 0.00595581 hartree
nonthermalcorr: 0.15595671 hartree
totalcorr: 0.16191253 hartree
thermalcorrenthalpy: 0.00094421 hartree
totalenthalpy: -230.26821826 hartree
totalentropycorr: -0.03568049 hartree
gibbsenthalpy: -230.30389875 hartree
gibbsminuselec: 0.12717625 hartree
