program: Orca
programVersion: 6.0.0
elementType: C H H N H H C H H C H H C H H C H H C H H C H H C H H C H H N H H H
charge: 1
multiplicity: 1
keywords: opt freq wB97x-D3BJ def2-TZVPPD TightSCF defgrid3 RIJCOSX
keywords: PAL8
frequency: 0.00 0.00 0.00 0.00 0.00 0.00 28.43 43.46 52.78 70.38 97.91 112.99 120.78 141.25 163.94 171.17 199.80 211.82 221.23 259.26 318.55 380.33 431.44 499.46 516.41 735.45 739.59 751.34 773.15 812.26 830.36 869.04 897.03 927.52 975.98 984.52 1019.63 1037.15 1038.38 1059.80 1074.69 1074.75 1092.26 1095.68 1111.00 1131.63 1170.76 1221.09 1243.16 1254.00 1283.99 1291.21 1321.91 1324.61 1336.12 1342.02 1348.09 1353.82 1361.35 1365.40 1395.48 1400.07 1420.59 1428.80 1432.87 1437.64 1493.03 1494.89 1496.69 1498.95 1501.78 1507.66 1514.26 1515.41 1520.40 1524.66 1666.66 1669.34 1672.92 3035.16 3037.76 3040.42 3042.84 3043.97 3048.60 3055.67 3056.78 3061.37 3066.13 3072.71 3079.93 3086.97 3097.12 3104.37 3110.08 3114.26 3175.94 3445.02 3527.21 3533.17 3548.29 3627.26
frequency: 28.43 43.46 52.78 70.38 97.91 112.99 120.78 141.25 163.94 171.17 199.80 211.82 221.23 259.26 318.55 380.33 431.44 499.46 516.41 735.45 739.59 751.34 773.15 812.26 830.36 869.04 897.03 927.52 975.98 984.52 1019.63 1037.15 1038.38 1059.80 1074.69 1074.75 1092.26 1095.68 1111.00 1131.63 1170.76 1221.09 1243.16 1254.00 1283.99 1291.21 1321.91 1324.61 1336.12 1342.02 1348.09 1353.82 1361.35 1365.40 1395.48 1400.07 1420.59 1428.80 1432.87 1437.64 1493.03 1494.89 1496.69 1498.95 1501.78 1507.66 1514.26 1515.41 1520.40 1524.66 1666.66 1669.34 1672.92 3035.16 3037.76 3040.42 3042.84 3043.97 3048.60 3055.67 3056.78 3061.37 3066.13 3072.71 3079.93 3086.97 3097.12 3104.37 3110.08 3114.26 3175.94 3445.02 3527.21 3533.17 3548.29 3627.26
formula: C9H23N2
InChI: InChI=1/C9H23N2/c10-8-6-4-2-1-3-5-7-9-11/h1-10H2,11H3
34 atoms
C  -2.555762 0.838031 -0.128986
H  -1.926426 0.226603 -0.775661
H  -2.877366 1.721528 -0.680433
N  -3.808995 0.023101 0.139111
H  -4.463278 0.550699 0.719328
H  -4.289735 -0.236414 -0.723312
C  -1.86938 1.191518 1.176377
H  -1.608186 0.274668 1.717014
H  -2.555624 1.761901 1.812663
C  -0.604122 2.013704 0.923823
H  -0.866681 2.925045 0.376259
H  0.075654 1.445247 0.280324
C  0.111688 2.385486 2.220212
H  -0.571776 2.950966 2.863467
H  0.369707 1.472108 2.767762
C  1.37532 3.205718 1.976129
H  2.056433 2.639589 1.330718
H  1.11565 4.117197 1.425914
C  2.09706 3.582137 3.267125
H  2.356285 2.67054 3.817581
H  1.415582 4.147975 3.912592
C  3.360571 4.402326 3.023059
H  4.040552 3.835799 2.37636
H  3.100075 5.312515 2.470567
C  4.086912 4.782811 4.31012
H  4.355306 3.875349 4.863803
H  3.412692 5.355023 4.958264
C  5.350987 5.604662 4.050491
H  6.024452 5.036438 3.401041
H  5.085768 6.509997 3.495292
N  6.102439 6.007682 5.233037
H  5.534761 6.574021 5.850299
H  6.409456 5.201597 5.762163
H  -3.578203 -0.835035 0.642586
totalener: -466.47030978209762 hartree
nucrepener: 609.76340423170518 hartree
electener: -1076.23371458692714 hartree
oneelecener: -1824.73713169181360 hartree
twoeener: 748.50341710488647 hartree
kineticenergy: 464.20766396296148 hartree
exchangeener: -44.805002248517 hartree
correlationener: -3.612080028735 hartree
xcener: -48.417082277253 hartree
energy: -400.9937 -392.8720 -286.1508 -284.1206 -283.1177 -282.3680 -281.8306 -281.4686 -281.4521 -281.1988 -280.9182 -36.3954 -30.1110 -29.0407 -28.3766 -27.3290 -26.2235 -25.1630 -24.6082 -24.3172 -23.3167 -22.5433 -21.5321 -21.4429 -21.0292 -20.6601 -19.0844 -18.6756 -18.4196 -17.9483 -17.6024 -17.1332 -16.8879 -16.2664 -16.2397 -15.8902 -15.3677 -15.3498 -14.5291 -14.5115 -13.8754 -13.8447 -13.7131 -13.3759 -10.7092 -3.3227 -1.9149 -1.6990 -1.6955 -0.6817 -0.6005 -0.3490 -0.2934 -0.0067 0.0646 0.2562 electronvolt
chargesum: 1.0000000
charge: -0.254565 0.087423 0.086144 0.118557 0.235745 0.252034 0.068971 0.111711 0.112393 -0.223847 0.110953 0.111011 -0.186624 0.078528 0.078927 -0.168541 0.063470 0.063140 -0.134413 0.063798 0.064060 -0.077852 0.066721 0.066514 0.055750 0.013707 0.013371 -0.103434 0.054976 0.054624 -0.398538 0.139986 0.140357 0.234942
charge: 0.066248 0.047195 0.047213 0.573732 0.037627 0.037115 -0.017371 0.032246 0.032320 -0.026295 0.030295 0.030300 -0.034056 0.026934 0.026920 -0.036859 0.025911 0.025896 -0.039958 0.024401 0.024392 -0.044442 0.023794 0.023783 -0.039604 0.019154 0.019144 -0.107331 0.020251 0.020245 0.308179 -0.107450 -0.107449 0.037519
qa: -0.2546 0.0874 0.0861 0.1186 0.2357 0.2520 0.0690 0.1117 0.1124 -0.2238 0.1110 0.1110 -0.1866 0.0785 0.0789 -0.1685 0.0635 0.0631 -0.1344 0.0638 0.0641 -0.0779 0.0667 0.0665 0.0557 0.0137 0.0134 -0.1034 0.0550 0.0546 -0.3985 0.1400 0.1404 0.2349
va: 3.7364 1.0693 1.0708 3.7171 0.9552 0.9365 3.4404 1.0615 1.0606 4.0273 1.0278 1.0282 3.9651 1.0250 1.0244 3.9559 1.0248 1.0252 3.9173 1.0235 1.0228 3.8931 1.0299 1.0307 3.7786 1.0990 1.0986 3.5684 1.0931 1.0938 2.6794 0.9965 0.9958 0.9563
dispcorr: -0.047830750 hartree
energy: -466.522973313311
temp: 298.15 k
press: 1.00 atm
zeropoint: 0.32781294 hartree
thermalvibcorrection: 0.01223154 hartree
thermalrotcorrection: 0.00141627 hartree
thermaltrasncorrection: 0.00141627 hartree
thermaltotal: -466.18009629 hartree
thermalcorr: 0.01506409 hartree
nonthermalcorr: 0.32781294 hartree
totalcorr: 0.34287703 hartree
thermalcorrenthalpy: 0.00094421 hartree
totalenthalpy: -466.17915208 hartree
totalentropycorr: -0.05692293 hartree
gibbsenthalpy: -466.23607500 hartree
gibbsminuselec: 0.28689831 hartree
