program: Orca
programVersion: 6.0.0
elementType: C H H N H H C H H C H H C H H C H H C H H C H H C H H C H H C H H C H H C H H N H H H H
charge: 2
multiplicity: 1
keywords: opt freq wB97x-D3BJ def2-TZVPPD TightSCF defgrid3 RIJCOSX
keywords: PAL8
frequency: 0.00 0.00 0.00 0.00 0.00 0.00 22.62 30.24 43.71 49.22 74.30 77.93 84.69 112.54 122.25 136.00 144.55 154.67 161.18 170.25 174.95 211.68 221.42 222.84 291.39 313.38 381.19 431.42 461.25 512.08 519.47 735.09 737.15 743.42 754.16 770.18 794.71 830.96 873.93 900.33 900.46 915.80 955.94 976.53 978.92 997.66 1020.30 1028.91 1039.09 1056.71 1058.99 1071.73 1078.68 1088.96 1095.83 1095.94 1106.86 1156.24 1177.12 1214.25 1233.29 1241.57 1262.26 1273.73 1291.44 1303.72 1317.22 1333.70 1338.02 1338.95 1346.46 1353.04 1353.38 1358.19 1363.78 1363.84 1364.26 1392.15 1414.83 1428.99 1433.00 1434.73 1439.56 1441.36 1494.99 1495.14 1497.93 1498.19 1500.94 1501.76 1505.57 1510.42 1515.60 1518.69 1519.44 1521.22 1524.93 1525.72 1667.54 1667.62 1672.60 1672.63 3040.88 3041.08 3043.40 3044.79 3046.00 3046.22 3048.33 3052.31 3057.94 3058.65 3066.04 3069.75 3074.56 3079.58 3083.81 3088.81 3095.97 3103.47 3111.08 3112.51 3114.54 3114.71 3175.83 3176.19 3442.36 3442.67 3524.53 3524.57 3527.71 3527.80
frequency: 22.62 30.24 43.71 49.22 74.30 77.93 84.69 112.54 122.25 136.00 144.55 154.67 161.18 170.25 174.95 211.68 221.42 222.84 291.39 313.38 381.19 431.42 461.25 512.08 519.47 735.09 737.15 743.42 754.16 770.18 794.71 830.96 873.93 900.33 900.46 915.80 955.94 976.53 978.92 997.66 1020.30 1028.91 1039.09 1056.71 1058.99 1071.73 1078.68 1088.96 1095.83 1095.94 1106.86 1156.24 1177.12 1214.25 1233.29 1241.57 1262.26 1273.73 1291.44 1303.72 1317.22 1333.70 1338.02 1338.95 1346.46 1353.04 1353.38 1358.19 1363.78 1363.84 1364.26 1392.15 1414.83 1428.99 1433.00 1434.73 1439.56 1441.36 1494.99 1495.14 1497.93 1498.19 1500.94 1501.76 1505.57 1510.42 1515.60 1518.69 1519.44 1521.22 1524.93 1525.72 1667.54 1667.62 1672.60 1672.63 3040.88 3041.08 3043.40 3044.79 3046.00 3046.22 3048.33 3052.31 3057.94 3058.65 3066.04 3069.75 3074.56 3079.58 3083.81 3088.81 3095.97 3103.47 3111.08 3112.51 3114.54 3114.71 3175.83 3176.19 3442.36 3442.67 3524.53 3524.57 3527.71 3527.80
formula: C12H30N2
InChI: InChI=1/C12H30N2/c13-11-9-7-5-3-1-2-4-6-8-10-12-14/h1-12H2,13-14H3
44 atoms
C  -2.57852 0.825815 -0.13194
H  -1.949774 0.215235 -0.77998
H  -2.899062 1.709997 -0.682896
N  -3.832393 0.012274 0.133206
H  -4.487782 0.535818 0.716293
H  -4.313696 -0.239057 -0.73193
C  -1.887654 1.179897 1.172664
H  -1.626588 0.263271 1.71336
H  -2.571879 1.751083 1.810083
C  -0.621448 2.00107 0.915713
H  -0.885022 2.91126 0.366906
H  0.055621 1.430969 0.270983
C  0.100233 2.375954 2.209237
H  -0.580544 2.942858 2.853757
H  0.36001 1.46392 2.757824
C  1.364303 3.196185 1.959128
H  2.042965 2.628647 1.312663
H  1.102734 4.106451 1.408149
C  2.090949 3.575308 3.247943
H  2.352954 2.664772 3.798447
H  1.411326 4.141387 3.894816
C  3.354009 4.397144 2.998888
H  4.033518 3.83138 2.351615
H  3.09177 5.307877 2.448823
C  4.080924 4.775886 4.287662
H  4.344401 3.86539 4.837353
H  3.401756 5.341513 4.935272
C  5.343298 5.598694 4.037621
H  6.024551 5.033995 3.391658
H  5.081352 6.511094 3.490672
C  6.065378 5.972932 5.331142
H  6.331616 5.062241 5.877828
H  5.387379 6.540006 5.977565
C  7.329329 6.79785 5.074894
H  8.01434 6.229946 4.435414
H  7.06557 7.715065 4.536558
C  8.020251 7.150255 6.380072
H  8.343534 6.265264 6.928066
H  7.390153 7.757485 7.029898
N  9.271624 7.96777 6.116291
H  9.927508 7.448589 5.529881
H  9.042688 8.833573 5.624791
H  -3.605737 -0.851866 0.628703
H  9.754473 8.217001 6.981177
totalener: -584.84394368478263 hartree
nucrepener: 863.68600802446804 hartree
electener: -1448.52995292839773 hartree
oneelecener: -2475.10469280231473 hartree
twoeener: 1026.57473987391700 hartree
kineticenergy: 581.96990668228125 hartree
exchangeener: -56.503687181420 hartree
correlationener: -4.572535483196 hartree
xcener: -61.076222664616 hartree
energy: -402.0066 -402.0061 -287.2248 -287.2248 -285.2797 -285.2796 -284.3888 -284.3887 -283.7743 -283.7741 -283.4120 -283.4119 -283.2533 -283.2481 -37.4067 -37.4057 -31.2616 -31.2537 -29.9953 -29.5499 -28.7317 -27.8206 -26.9183 -26.1906 -25.6431 -25.6169 -25.6162 -25.0251 -24.4350 -24.0668 -23.5197 -23.1717 -22.5382 -22.5218 -21.7985 -21.7912 -20.6080 -20.2663 -19.8690 -19.8657 -19.6024 -19.0997 -18.9246 -18.6876 -18.3682 -18.2480 -17.6766 -17.5790 -17.0389 -16.9490 -16.9402 -16.3684 -16.2957 -15.8796 -15.7783 -15.5915 -15.2459 -4.2768 -4.2754 -2.9012 -2.8938 -2.7527 -2.7525 -2.6954 -2.6878 -1.9726 -1.9056 -1.7501 electronvolt
chargesum: 2.0000000
charge: -0.260534 0.088739 0.088168 0.122479 0.236165 0.254323 0.071022 0.114704 0.116745 -0.235439 0.113294 0.113236 -0.183732 0.083480 0.082995 -0.174444 0.067703 0.069474 -0.142704 0.068692 0.069962 -0.147767 0.068932 0.069504 -0.169010 0.067328 0.068825 -0.183928 0.083460 0.082563 -0.235004 0.111893 0.114128 0.071697 0.115499 0.115201 -0.259033 0.089008 0.088818 0.121298 0.236179 0.236029 0.235992 0.254058
charge: 0.067450 0.047578 0.047568 0.575694 0.038820 0.039207 -0.014611 0.032405 0.032410 -0.024540 0.030400 0.030430 -0.031333 0.027298 0.027334 -0.033767 0.026376 0.026335 -0.035116 0.025652 0.025620 -0.035119 0.025650 0.025628 -0.033793 0.026356 0.026360 -0.031328 0.027323 0.027318 -0.024573 0.030389 0.030410 -0.014492 0.032388 0.032381 0.067493 0.047561 0.047567 0.575601 0.038822 0.038820 0.038791 0.039239
qa: -0.2605 0.0887 0.0882 0.1225 0.2362 0.2543 0.0710 0.1147 0.1167 -0.2354 0.1133 0.1132 -0.1837 0.0835 0.0830 -0.1744 0.0677 0.0695 -0.1427 0.0687 0.0700 -0.1478 0.0689 0.0695 -0.1690 0.0673 0.0688 -0.1839 0.0835 0.0826 -0.2350 0.1119 0.1141 0.0717 0.1155 0.1152 -0.2590 0.0890 0.0888 0.1213 0.2362 0.2360 0.2360 0.2541
va: 3.7381 1.0719 1.0721 3.7169 0.9554 0.9345 3.4272 1.0610 1.0590 4.0125 1.0290 1.0283 3.9406 1.0223 1.0229 3.8796 1.0233 1.0229 3.8282 1.0167 1.0156 3.8334 1.0164 1.0165 3.8824 1.0242 1.0226 3.9368 1.0228 1.0234 4.0067 1.0300 1.0283 3.4370 1.0600 1.0609 3.7386 1.0713 1.0717 3.7179 0.9556 0.9557 0.9558 0.9352
dispcorr: -0.063636717 hartree
energy: -584.912416178261
temp: 298.15 k
press: 1.00 atm
zeropoint: 0.42931737 hartree
thermalvibcorrection: 0.01636826 hartree
thermalrotcorrection: 0.00141627 hartree
thermaltrasncorrection: 0.00141627 hartree
thermaltotal: -584.46389800 hartree
thermalcorr: 0.01920081 hartree
nonthermalcorr: 0.42931737 hartree
totalcorr: 0.44851818 hartree
thermalcorrenthalpy: 0.00094421 hartree
totalenthalpy: -584.46295379 hartree
totalentropycorr: -0.06603699 hartree
gibbsenthalpy: -584.52899078 hartree
gibbsminuselec: 0.38342540 hartree
