program: Orca
programVersion: 6.0.0
elementType: C H H N H H C H H C H H C H H C H H C H H C H H C H H N H H H H
charge: 2
multiplicity: 1
keywords: opt freq wB97x-D3BJ def2-TZVPPD TightSCF defgrid3 RIJCOSX
keywords: PAL8
frequency: 0.00 0.00 0.00 0.00 0.00 0.00 38.69 55.41 56.67 85.25 107.70 134.93 136.08 155.24 170.52 219.80 221.73 223.45 240.93 363.64 397.83 481.79 505.56 738.26 746.51 763.23 791.89 842.12 900.69 901.88 907.11 953.66 978.12 983.55 1009.22 1037.62 1050.41 1063.52 1077.11 1084.71 1092.59 1144.24 1179.89 1216.70 1253.72 1264.49 1297.51 1309.96 1333.01 1347.71 1354.32 1357.29 1358.20 1366.19 1369.52 1397.03 1427.19 1438.21 1441.01 1445.30 1497.79 1497.91 1502.40 1503.41 1509.09 1516.08 1521.67 1523.40 1526.70 1527.69 1668.42 1668.57 1672.00 1672.07 3048.10 3048.68 3049.51 3051.73 3059.00 3062.97 3077.50 3083.42 3088.85 3097.73 3110.34 3114.66 3114.77 3117.43 3175.63 3175.93 3439.30 3439.61 3521.08 3521.15 3521.77 3521.90
frequency: 38.69 55.41 56.67 85.25 107.70 134.93 136.08 155.24 170.52 219.80 221.73 223.45 240.93 363.64 397.83 481.79 505.56 738.26 746.51 763.23 791.89 842.12 900.69 901.88 907.11 953.66 978.12 983.55 1009.22 1037.62 1050.41 1063.52 1077.11 1084.71 1092.59 1144.24 1179.89 1216.70 1253.72 1264.49 1297.51 1309.96 1333.01 1347.71 1354.32 1357.29 1358.20 1366.19 1369.52 1397.03 1427.19 1438.21 1441.01 1445.30 1497.79 1497.91 1502.40 1503.41 1509.09 1516.08 1521.67 1523.40 1526.70 1527.69 1668.42 1668.57 1672.00 1672.07 3048.10 3048.68 3049.51 3051.73 3059.00 3062.97 3077.50 3083.42 3088.85 3097.73 3110.34 3114.66 3114.77 3117.43 3175.63 3175.93 3439.30 3439.61 3521.08 3521.15 3521.77 3521.90
formula: C8H22N2
InChI: InChI=1/C8H22N2/c9-7-5-3-1-2-4-6-8-10/h1-8H2,9-10H3
32 atoms
C  -2.55673 0.83748 -0.116928
H  -1.925167 0.230321 -0.76548
H  -2.87704 1.722424 -0.666841
N  -3.809217 0.021437 0.140806
H  -4.471439 0.53944 0.721643
H  -4.285101 -0.225407 -0.729239
C  -1.86604 1.191674 1.189758
H  -1.603662 0.274991 1.729183
H  -2.5515 1.760481 1.827518
C  -0.600633 2.016043 0.932922
H  -0.86618 2.926261 0.385534
H  0.077046 1.447917 0.287446
C  0.121689 2.39097 2.227538
H  -0.55842 2.957082 2.872827
H  0.384328 1.47942 2.774816
C  1.385256 3.213915 1.974246
H  2.065309 2.647786 1.328915
H  1.122562 4.125455 1.426975
C  2.107806 3.588939 3.26875
H  2.373442 2.67868 3.816034
H  1.430099 4.15696 3.914284
C  3.373156 4.413447 3.011836
H  4.058462 3.844875 2.373716
H  3.110685 5.33017 2.472548
C  4.063854 4.767159 4.318785
H  4.384309 3.881845 4.867962
H  3.432035 5.373978 4.967355
N  5.316062 5.583431 4.061387
H  5.978109 5.066575 3.479339
H  5.093611 6.452743 3.572482
H  -3.586577 -0.847094 0.631028
H  5.793225 5.829498 4.930958
totalener: -427.43419199914035 hartree
nucrepener: 544.31370826716216 hartree
electener: -971.74790161914598 hartree
oneelecener: -1631.42495138337790 hartree
twoeener: 659.67704976423192 hartree
kineticenergy: 425.41493850525148 hartree
exchangeener: -41.009438824240 hartree
correlationener: -3.296300063991 hartree
xcener: -44.305738888231 hartree
energy: -402.5528 -402.5514 -287.8500 -287.8496 -286.0252 -286.0247 -285.3100 -285.3099 -284.9418 -284.9367 -37.9521 -37.9518 -32.1332 -31.8895 -30.6550 -29.3759 -28.0305 -26.9703 -26.2679 -26.1596 -26.1584 -25.5390 -25.0109 -24.9585 -23.2181 -23.1970 -22.6395 -22.4193 -21.3533 -20.9016 -20.3924 -20.3861 -19.7125 -19.4306 -19.4018 -18.5770 -18.3751 -17.8034 -17.5469 -17.3349 -17.2880 -4.7538 -4.7458 -3.4475 -3.4460 -3.3698 -3.2851 -3.2258 -3.1920 -2.5982 -2.5815 -2.1651 electronvolt
chargesum: 2.0000000
charge: -0.273949 0.092995 0.093201 0.122958 0.236339 0.256129 0.053207 0.119320 0.119516 -0.256869 0.121271 0.121269 -0.227788 0.093626 0.093152 -0.227763 0.093073 0.093186 -0.259002 0.121029 0.120963 0.057105 0.119683 0.119817 -0.276021 0.092482 0.093101 0.123429 0.236083 0.236213 0.236171 0.256074
charge: 0.069681 0.048416 0.048415 0.578192 0.040466 0.041616 -0.010186 0.033136 0.033146 -0.020353 0.031516 0.031518 -0.024800 0.029395 0.029389 -0.024798 0.029386 0.029384 -0.020353 0.031504 0.031502 -0.010095 0.033123 0.033121 0.069719 0.048403 0.048405 0.578107 0.040473 0.040472 0.040449 0.041651
qa: -0.2739 0.0930 0.0932 0.1230 0.2363 0.2561 0.0532 0.1193 0.1195 -0.2569 0.1213 0.1213 -0.2278 0.0936 0.0932 -0.2278 0.0931 0.0932 -0.2590 0.1210 0.1210 0.0571 0.1197 0.1198 -0.2760 0.0925 0.0931 0.1234 0.2361 0.2362 0.2362 0.2561
va: 3.7605 1.0729 1.0729 3.7192 0.9560 0.9338 3.4755 1.0599 1.0594 4.0645 1.0304 1.0304 4.0514 1.0296 1.0298 4.0525 1.0300 1.0299 4.0660 1.0303 1.0305 3.4703 1.0595 1.0593 3.7637 1.0735 1.0727 3.7194 0.9562 0.9560 0.9562 0.9339
dispcorr: -0.044104711 hartree
energy: -427.483281250309
temp: 298.15 k
press: 1.00 atm
zeropoint: 0.31454020 hartree
thermalvibcorrection: 0.01094094 hartree
thermalrotcorrection: 0.00141627 hartree
thermaltrasncorrection: 0.00141627 hartree
thermaltotal: -427.15496756 hartree
thermalcorr: 0.01377349 hartree
nonthermalcorr: 0.31454020 hartree
totalcorr: 0.32831369 hartree
thermalcorrenthalpy: 0.00094421 hartree
totalenthalpy: -427.15402335 hartree
totalentropycorr: -0.05400305 hartree
gibbsenthalpy: -427.20802640 hartree
gibbsminuselec: 0.27525485 hartree
