program: Orca
programVersion: 6.0.0
elementType: C H H N H H C H H N H H H H
charge: 2
multiplicity: 1
keywords: opt freq wB97x-D3BJ def2-TZVPPD TightSCF defgrid3 RIJCOSX
keywords: PAL8
frequency: 0.00 0.00 0.00 0.00 0.00 0.00 117.35 211.50 240.70 270.38 429.40 786.47 881.30 906.41 983.18 1016.00 1044.31 1050.29 1205.20 1251.49 1376.29 1387.34 1418.75 1491.76 1510.46 1519.90 1564.90 1565.12 1660.86 1665.52 1668.50 1671.14 3099.04 3106.04 3153.79 3171.62 3397.21 3402.13 3462.01 3462.50 3474.68 3475.15
frequency: 117.35 211.50 240.70 270.38 429.40 786.47 881.30 906.41 983.18 1016.00 1044.31 1050.29 1205.20 1251.49 1376.29 1387.34 1418.75 1491.76 1510.46 1519.90 1564.90 1565.12 1660.86 1665.52 1668.50 1671.14 3099.04 3106.04 3153.79 3171.62 3397.21 3402.13 3462.01 3462.50 3474.68 3475.15
formula: C2H10N2
InChI: InChI=1/C2H10N2/c3-1-2-4/h1-2H2,3-4H3
14 atoms
C  -2.511153 0.822706 -0.12854
H  -1.982052 -0.099609 -0.3749
H  -2.443026 1.505977 -0.976954
N  -3.967221 0.459383 0.018104
H  -4.313475 0.037463 -0.851843
H  -4.131532 -0.22607 0.763339
C  -1.97996 1.459335 1.16252
H  -2.046666 0.775608 2.010633
H  -2.5102 2.380786 1.409621
N  -0.524196 1.824208 1.014874
H  -0.178917 2.24946 1.883621
H  0.071516 1.010071 0.828874
H  -4.562077 1.27338 0.207262
H  -0.360489 2.507154 0.267195
totalener: -191.23631624779341 hartree
nucrepener: 149.79606921658294 hartree
electener: -341.03238312114496 hartree
oneelecener: -537.83061420208037 hartree
twoeener: 196.79823108093541 hartree
kineticenergy: 190.56688816872389 hartree
exchangeener: -17.763999997243 hartree
correlationener: -1.382353145637 hartree
xcener: -19.146353142880 hartree
energy: -405.5933 -405.5920 -291.6065 -291.6016 -41.1492 -40.7960 -34.9549 -31.8028 -29.3633 -29.0150 -28.8539 -28.8170 -26.8035 -25.9602 -25.5351 -23.9884 -23.4091 -7.3048 -7.1318 -5.8461 -5.8186 -5.2753 -5.2251 -4.7739 -4.5511 -4.5101 -4.1536 -4.1315 electronvolt
chargesum: 2.0000000
charge: -0.160295 0.158683 0.158807 0.079437 0.272492 0.245676 -0.160783 0.158540 0.158979 0.079316 0.272581 0.245609 0.245410 0.245547
charge: 0.108046 0.058308 0.058284 0.599359 0.061558 0.057231 0.108169 0.058277 0.058262 0.599390 0.061559 0.057216 0.057171 0.057171
qa: -0.1603 0.1587 0.1588 0.0794 0.2725 0.2457 -0.1608 0.1585 0.1590 0.0793 0.2726 0.2456 0.2454 0.2455
va: 3.7506 1.0823 1.0819 3.7557 0.9284 0.9650 3.7510 1.0824 1.0819 3.7557 0.9283 0.9652 0.9654 0.9652
dispcorr: -0.014730447 hartree
energy: -191.261235674815
temp: 298.15 k
press: 1.00 atm
zeropoint: 0.14147122 hartree
thermalvibcorrection: 0.00289789 hartree
thermalrotcorrection: 0.00141627 hartree
thermaltrasncorrection: 0.00141627 hartree
thermaltotal: -191.11403402 hartree
thermalcorr: 0.00573043 hartree
nonthermalcorr: 0.14147122 hartree
totalcorr: 0.14720165 hartree
thermalcorrenthalpy: 0.00094421 hartree
totalenthalpy: -191.11308982 hartree
totalentropycorr: -0.03481416 hartree
gibbsenthalpy: -191.14790397 hartree
gibbsminuselec: 0.11333170 hartree
