program: Orca
programVersion: 5.0.2
elementType: K C C H H N N N K C C H H N N N C C H H N N N K K
charge: 1
multiplicity: 1
keywords: opt freq wB97X-D3 def2-TZVP TightSCF def2/J def2-TZVP/C RIJCOSX defgrid3
keywords: PAL8
frequency: 0.00 0.00 0.00 0.00 0.00 0.00 -14.20 -13.54 -5.22 9.40 11.44 13.64 24.53 35.12 43.91 47.40 50.06 75.24 85.49 90.81 93.68 109.08 110.29 124.39 132.80 140.48 187.01 192.28 230.77 237.33 703.33 703.84 713.40 716.54 716.92 727.53 881.42 882.42 887.33 888.19 907.79 916.57 990.77 1004.29 1004.70 1009.83 1015.40 1015.59 1078.04 1084.10 1085.59 1184.60 1185.03 1194.92 1218.02 1242.41 1242.67 1308.14 1308.94 1310.21 1329.62 1334.97 1335.97 1422.12 1475.81 1476.34 1544.62 1561.43 1562.65 3235.02 3236.11 3236.99 3239.72 3241.07 3241.54
frequency: 9.40 11.44 13.64 24.53 35.12 43.91 47.40 50.06 75.24 85.49 90.81 93.68 109.08 110.29 124.39 132.80 140.48 187.01 192.28 230.77 237.33 703.33 703.84 713.40 716.54 716.92 727.53 881.42 882.42 887.33 888.19 907.79 916.57 990.77 1004.29 1004.70 1009.83 1015.40 1015.59 1078.04 1084.10 1085.59 1184.60 1185.03 1194.92 1218.02 1242.41 1242.67 1308.14 1308.94 1310.21 1329.62 1334.97 1335.97 1422.12 1475.81 1476.34 1544.62 1561.43 1562.65 3235.02 3236.11 3236.99 3239.72 3241.07 3241.54
formula: C6H6N9K4
InChI: InChI=1/3C2H2N3.4K/c3*1-3-2-5-4-1;;;;/h3*1-2H;;;;/q2*-3;-1;2*+1;+2;+3/rC6H6K4N9/c7-11-1-13-9(14(13)2-11)18-5-10(18,6(17(5)10)19(9,10)18)15-3-12(8)4-16(10)15/h1-6H
25 atoms
K  -26.358457 5.542232 2.101403
C  -28.521194 7.535409 1.469536
C  -28.813928 5.793476 0.382253
H  -28.250452 8.542936 1.755728
H  -28.836951 5.064345 -0.41666
N  -29.323331 5.548987 1.584303
N  -28.27645 7.016562 0.256462
N  -29.130532 6.698324 2.30135
K  -31.277331 5.506035 3.489069
C  -34.73774 5.870296 5.494082
C  -34.433015 3.812186 5.3538
H  -35.156087 6.844721 5.707258
H  -34.549503 2.739461 5.427827
N  -33.384854 4.370525 4.790358
N  -35.333059 4.703574 5.822828
N  -33.584521 5.717631 4.882544
C  -22.537249 5.549323 3.271137
C  -22.984382 3.540814 2.931546
H  -22.02428 6.472258 3.505488
H  -22.915063 2.466485 2.828985
N  -24.10291 4.198914 2.723373
N  -21.949233 4.333779 3.282227
N  -23.809779 5.51393 2.9455
K  -37.663481 4.319683 6.883795
K  -19.443857 3.773033 3.637037
totalener: -3124.84251238 hartree
nucrepener: 1666.80325640 hartree
electener: -4791.64576878 hartree
oneelecener: -7595.02433116 hartree
twoeener: 2803.37856238 hartree
kineticenergy: 3118.48296030 hartree
xcener: -167.758206948670 hartree
chargesum: 1.0000000
charge: 0.764270 -0.000528 -0.012160 0.128389 0.127877 -0.327808 -0.367487 -0.330716 0.790958 0.061715 0.060769 0.120702 0.119376 -0.288826 -0.577282 -0.294302 0.063089 0.060698 0.122105 0.121285 -0.288363 -0.575181 -0.290737 0.905461 0.906698
charge: 0.420468 -0.368432 -0.370013 0.136449 0.136179 -0.016765 0.059613 -0.016569 0.462025 -0.365765 -0.366221 0.128826 0.127977 -0.006251 -0.004795 -0.006632 -0.363786 -0.363954 0.129450 0.128605 -0.006220 -0.003295 -0.005732 0.766737 0.768102
qa: 0.7643 -0.0005 -0.0122 0.1284 0.1279 -0.3278 -0.3675 -0.3307 0.7910 0.0617 0.0608 0.1207 0.1194 -0.2888 -0.5773 -0.2943 0.0631 0.0607 0.1221 0.1213 -0.2884 -0.5752 -0.2907 0.9055 0.9067
va: 0.5018 3.9008 3.9095 0.9786 0.9794 2.6404 2.8631 2.6462 0.4455 3.9948 3.9925 0.9831 0.9835 2.8488 2.8326 2.8506 3.9842 3.9841 0.9826 0.9832 2.8454 2.8341 2.8484 0.1893 0.1870
dispcorr: -0.007078931 hartree
energy: -3124.855632645995
dipole: 0.39466 0.20526 0.59992 2.70820 -5.86848 -3.16029 -4.26091 9.11477 4.85386
magnitude: 5.82300 au
magnitude: 14.80089 debye
temp: 298.15 k
press: 1.00 atm
zeropoint: 0.14727828 hartree
thermalvibcorrection: 0.01716621 hartree
thermalrotcorrection: 0.00141627 hartree
thermaltrasncorrection: 0.00141627 hartree
thermaltotal: -3124.68835561 hartree
thermalcorr: 0.01999876 hartree
nonthermalcorr: 0.14727828 hartree
totalcorr: 0.16727703 hartree
thermalcorrenthalpy: 0.00094421 hartree
totalenthalpy: -3124.68741140 hartree
totalentropycorr: -0.07351775 hartree
gibbsenthalpy: -3124.76092916 hartree
gibbsminuselec: 0.09470349 hartree
