program: Gaussian 16
title: phenonium ion with F
version: ES64L-G16RevC.01
method: RmPW1PW91
basis: 6-31+G(d,p)
operation: Freq
keyword: #N
keyword: Geom=AllCheck
keyword: Guess=TCheck
keyword: SCRF=Check
keyword: GenChk
keyword: RmPW1PW91/6-31+G(d,p)
keyword: Freq
converged: YES YES NO YES
title: Mulliken charges:
elementType: C C H C H H C H H C C C H C H H H C H C C H C H H H C H H C H H C C C H H H C H H H C H H H C H H H H H H
charge: -0.483908 -0.217416 0.212572 -0.340154 0.170465 0.202772 -0.235824 0.198717 0.186388 0.182825 -0.433037 -0.487430 0.150437 -0.395560 0.164431 0.147315 0.165193 0.019246 0.112591 -0.027323 0.413709 0.202392 -0.720734 0.164060 0.183310 0.167448 -0.403234 0.199356 0.185877 -0.254662 0.179149 0.165704 0.331656 0.379031 -0.542324 0.244154 0.203282 0.228571 -0.505324 0.217873 0.248178 0.220608 -0.476365 0.143928 0.197202 0.179592 -0.813086 0.195325 0.147867 0.174467 0.117266 0.152820 0.180605
chargesum: 1.00000
title: Mulliken charges with hydrogens summed into heavy atoms:
elementType: C C C C C C C C C C C C C C C C C C C C
charge: -0.303303 -0.004843 0.033082 0.149281 0.182825 -0.083244 -0.175684 -0.027975 0.131837 0.089943 0.413709 -0.205917 -0.064537 0.090190 0.331656 0.379031 0.133683 0.181335 0.044357 -0.295426
1716.lowfreq: 0.0005 0.0007 0.0008 3.7130 5.7175 8.3336 24.7329 48.1576 52.8860
frequency: 24.6481 48.1467 52.8769 75.2697 86.5456 93.2590 106.7396 125.1647 132.6006 163.6975 171.3159 178.5217 188.5495 192.8649 225.6219 233.7712 254.9338 276.0805 297.6122 303.3976 319.1491 326.2642 333.6853 370.0377 381.7964 384.2414 417.8045 428.0838 449.8600 467.8589 489.9899 509.1780 527.2108 532.8127 553.2135 573.2453 578.6445 615.5071 655.1099 744.6966 771.4016 801.2284 812.0478 830.3327 833.0038 843.0314 866.6077 882.3106 907.6830 916.7965 933.1901 943.7297 950.7633 959.5268 982.5353 984.6716 991.5577 993.7347 1006.2731 1012.6927 1019.0998 1039.1247 1052.3790 1057.3098 1063.9182 1079.2974 1092.1709 1105.6995 1119.6768 1132.9288 1137.0938 1162.9939 1175.8811 1177.7767 1203.8164 1217.0364 1224.7873 1237.7011 1240.7636 1251.6685 1260.0647 1279.7493 1287.3300 1296.6017 1312.1319 1322.9671 1330.3084 1344.7138 1352.9248 1359.3540 1362.5161 1365.2745 1375.6527 1383.2849 1393.1488 1401.2477 1409.5460 1421.7610 1427.6939 1432.8201 1435.4422 1448.9643 1476.5004 1478.9596 1484.4966 1485.4892 1488.0629 1489.9258 1492.9437 1494.4671 1496.9044 1501.2439 1502.2021 1508.0435 1508.3432 1512.1559 1518.8854 1538.3697 1745.4872 1762.0121 3029.2536 3034.8797 3043.0562 3050.2731 3054.8469 3059.5719 3063.8903 3069.6228 3075.9056 3081.5494 3083.6845 3089.1332 3106.6999 3108.2476 3110.2438 3112.0265 3119.3802 3124.9537 3135.5842 3138.5569 3142.7184 3143.8414 3145.8473 3149.8387 3150.5661 3158.7350 3163.3113 3166.2023 3167.0995 3178.1920 3183.5137 3208.1313 3226.2542
redmass: 2.9954 1.4132 2.4639 2.7215 2.9227 2.5017 2.5626 1.5603 1.4932 1.8716 1.4801 1.4234 2.2155 1.8552 2.2971 2.3259 2.1662 2.0340 2.5544 2.1611 2.3240 2.2211 2.7602 2.4096 2.3675 2.2143 2.1489 2.4266 2.7077 2.2665 2.5147 2.6149 2.5774 2.5264 2.8206 2.3815 2.3618 2.8411 2.9282 2.3577 2.3278 2.1802 1.4110 1.8252 2.3601 1.9963 1.6234 2.0306 1.8277 1.9369 2.0235 2.0140 1.8108 1.9247 1.5777 1.7809 2.2363 1.8249 1.5999 1.9642 1.9596 1.8987 1.7270 1.7598 1.5356 2.1033 1.8577 2.0010 1.6432 1.9725 2.3239 1.6655 1.3828 1.6834 1.4112 1.4607 1.2475 1.5304 1.4833 1.7062 1.3469 1.2975 1.3873 1.3408 1.4168 1.3639 1.3125 1.4062 1.4567 1.4494 1.4552 1.3117 1.3346 1.3279 1.3342 1.2943 1.2359 1.2055 1.1739 1.4711 1.4160 1.1521 1.0775 1.0796 1.0788 1.1011 1.1819 1.1281 1.0713 1.0841 1.1030 1.1666 1.1211 1.1005 1.0748 1.1028 1.1785 1.6671 7.0627 7.1530 1.0539 1.0695 1.0545 1.0433 1.0640 1.0772 1.0398 1.0598 1.0652 1.0385 1.0638 1.0724 1.0987 1.0992 1.0619 1.0919 1.1040 1.0990 1.0923 1.0795 1.0952 1.0789 1.0950 1.0954 1.0954 1.1002 1.1017 1.1004 1.0996 1.0968 1.0873 1.1069 1.1016
irintensity: 1.4625 1.3183 0.9457 0.7951 1.6399 8.6866 1.3707 0.0762 2.2097 0.6175 1.1362 0.6639 1.6388 0.3876 1.4145 0.5670 5.7781 0.7398 0.7213 0.4233 2.7104 0.7069 0.1412 0.4182 0.5987 0.3100 0.6139 0.0745 1.6303 1.9954 1.9953 3.6716 4.4497 3.5563 9.5470 5.9168 7.5627 6.1409 50.0010 24.1177 6.6127 5.3603 4.1786 39.6873 0.3517 3.4094 14.3078 12.7827 1.3526 29.3374 47.1194 0.5271 3.1314 26.2084 9.9559 1.8425 1.0272 2.6778 1.2203 1.9085 36.3030 3.1369 10.1218 14.4388 4.2829 2.2834 31.5084 16.7810 18.9706 8.0138 2.4367 1.7529 0.1429 5.9065 2.1549 2.5774 3.1123 0.6408 0.6107 4.4081 12.6879 16.7565 10.2247 4.1492 27.0356 9.2260 3.1122 0.3446 2.3443 7.1958 0.4072 11.3228 3.1182 45.2887 98.5925 1.1140 1.3174 8.5913 8.5232 1.7927 36.6014 7.8903 12.8252 4.4013 6.9514 12.3545 23.7737 0.4025 9.4416 3.8682 11.8286 36.5421 16.5967 0.6870 31.3929 5.5682 3.6901 29.2643 24.1880 2.7668 18.7386 15.8913 25.5990 19.6618 18.2093 22.5924 16.6826 19.7809 16.4944 9.6293 40.7637 12.7096 21.0886 21.9550 11.1444 14.4756 12.0808 7.3692 0.4261 1.2732 5.2221 6.4802 2.2780 16.6452 23.8682 19.2622 7.7089 26.9738 15.1609 15.7922 16.3113 0.2023 2.6979
temp: 298.150 k
press: 1.00000 atm
elementType: 6 6 1 6 1 1 6 1 1 6 6 6 1 6 1 1 1 6 1 6 6 1 6 1 1 1 6 1 1 6 1 1 6 6 6 1 1 1 6 1 1 1 6 1 1 1 6 1 1 1 1 1 1
symmnumber: 1
zpe: 1281606.4 jmol-1
zpe.correction: 0.488138 hartree
zpe.thermalcorrener: 0.510486 hartree
zpe.thermalcorrenthalpy: 0.511430 hartree
zpe.thermalcorrgfe: 0.438071 hartree
zpe.sumelectzpe: -781.089633 hartree
zpe.sumelectthermal: -781.067285 hartree
zpe.sumelectthermalent: -781.066340 hartree
zpe.sumelectthermalfe: -781.139700 hartree
dipole: -9.6569 2.3948 0.0837
dipole: 9.9497
quadrupole: -69.5262 -108.1357 -114.5054
quadrupole: -11.7801 -4.8960 0.4056
quadrupole: 27.8629 -10.7466 -17.1163 -11.7801 -4.8960 0.4056
hfenergy: -781.5777709 hartree
pointgroup: C01 [X(C20H33)]
dipole: 3.7777027 -1.0258916 0.0057499 debye
polarizability: 280.0304508|-18.1146143|219.0494344|2.7318033|1.8854203|188.2432811 unknown
InChI: InChI=1/20C.33H
charge 1 multiplicity 1
53 atoms
C  1.20961562 -0.0226327 -0.08284459
C  2.73328092 -0.23701732 -0.72428418
H  2.56189597 -0.69665232 -1.69781795
C  3.34838142 1.14899256 -0.87677667
H  3.9049247 1.46050375 0.00916831
H  4.05230099 1.15250186 -1.71266177
C  2.13515023 2.04183888 -1.10824304
H  2.36703891 3.10387651 -0.99656938
H  1.75525214 1.89822355 -2.12647854
C  1.09044864 1.56802095 -0.08716827
C  -0.31342957 2.10055508 -0.47715259
C  -0.43885309 -2.06712564 -0.03095696
H  -0.5323507 1.82419179 -1.51267585
C  0.18166958 -0.88627239 -0.83846534
H  -0.15766637 -3.02587683 -0.48149327
H  -0.04681049 -2.07057525 0.99223042
H  0.59543055 -1.24304101 -1.78596526
C  -1.44056497 1.71993282 0.43959139
H  -1.19459714 1.68557932 1.49871345
C  -2.50102621 -1.27614033 1.04615626
C  -1.94198084 -1.91406031 0.008901
H  -0.6383507 -0.22142687 -1.11606449
C  -2.66055239 -2.3662259 -1.2297196
H  -2.26885677 -1.87818224 -2.13054894
H  -2.51717874 -3.4433446 -1.37266371
H  -3.73425596 -2.18405225 -1.18976586
C  -3.84632365 -0.62766512 1.1172481
H  -0.19638351 3.19414284 -0.48878558
H  -4.39889904 -0.93951871 2.00999073
C  -3.65235387 0.91468191 1.18188724
H  -4.63190044 1.39749478 1.09361119
H  -3.25651874 1.17593187 2.1685285
C  -2.70762912 1.41587217 0.11393061
C  3.17540616 -1.19951721 0.23822001
C  3.8618191 -0.83628811 1.49318286
H  4.9241863 -1.08160999 1.33659266
H  3.80357127 0.21910351 1.74526642
H  3.53298855 -1.45340021 2.33203812
C  2.98590744 -2.63726668 -0.03785567
H  2.23664565 -2.82899463 -0.8051798
H  3.94964273 -2.983865 -0.44621531
H  2.79454924 -3.22811549 0.85891617
C  1.45804494 2.10165785 1.30627013
H  2.49719763 1.89900877 1.57399931
H  1.32892253 3.18673136 1.336017
H  0.83111475 1.67213978 2.09038617
C  -3.26869771 1.46495594 -1.27652295
H  -4.08582329 2.19326175 -1.321775
H  -2.53761478 1.75071967 -2.0339938
H  -3.69871038 0.49990552 -1.56362217
H  -1.84695545 -1.03612189 1.88621295
H  -4.46517398 -0.89201521 0.25687496
H  1.1786129 -0.32362459 0.97214261
