program: Gaussian 16
title: phenonium ion with F
version: ES64L-G16RevC.01
method: RmPW1PW91
basis: 6-31+G(d,p)
operation: Freq
keyword: #N
keyword: Geom=AllCheck
keyword: Guess=TCheck
keyword: SCRF=Check
keyword: GenChk
keyword: RmPW1PW91/6-31+G(d,p)
keyword: Freq
converged: YES YES YES YES
title: Mulliken charges:
elementType: C C H C H H C H H C C C H C H H H C H C C H C H H H C H H C H H C H C H C H H H C H H H C H H H C H H H H
charge: -0.621441 -0.073128 0.153037 -0.322548 0.187818 0.184382 -0.423902 0.197247 0.186664 -0.206954 -0.223538 -0.490707 0.161445 -0.074924 0.254331 0.215321 0.163490 0.297859 0.169496 -0.455933 0.411079 0.189270 -0.513508 0.252117 0.218874 0.244128 -0.353655 0.174854 0.204718 -0.348178 0.184743 0.196188 -0.010820 0.177232 0.263680 0.173835 -0.592302 0.172316 0.177206 0.168565 -0.589156 0.154258 0.162326 0.185492 -0.348770 0.188286 0.194497 0.162564 -0.573427 0.172319 0.185982 0.177618 0.259655
chargesum: 1.00000
title: Mulliken charges with hydrogens summed into heavy atoms:
elementType: C C C C C C C C C C C C C C C C C C C C
charge: -0.621441 0.079909 0.049652 -0.039992 -0.206954 -0.062092 -0.021055 0.277836 0.467355 -0.196278 0.411079 0.201612 0.025917 0.032753 0.166411 0.437516 -0.074215 -0.087080 0.196577 -0.037509
1716.lowfreq: -56.2795 0.0005 0.0008 0.0009 1.0730 4.5548 7.0203 44.4983 47.8964
frequency: -56.2618 44.4840 47.8950 72.0857 113.0238 126.7266 143.7693 146.7276 152.4518 168.9258 193.3949 201.4469 220.5370 237.4833 247.4845 255.5361 272.3851 282.4241 299.3545 307.2997 325.8995 328.7203 357.2580 362.3966 391.4306 398.8174 430.6558 453.3559 482.1393 500.5354 518.5761 548.0728 562.8011 587.8417 588.9290 621.7439 644.1481 714.3891 727.0166 755.8749 800.7075 814.9452 831.2846 872.0376 876.2625 890.3885 900.7183 908.8128 928.8782 933.6297 943.7044 957.9371 969.6050 973.2814 983.4903 996.4476 1000.6533 1006.2029 1026.0576 1034.0712 1048.8592 1061.2402 1072.3217 1076.0401 1081.8072 1095.5063 1115.5598 1128.1783 1138.7510 1146.0594 1163.4877 1171.5367 1176.9183 1197.5496 1201.4344 1213.4859 1220.3810 1231.5724 1243.4753 1254.0634 1261.8744 1280.7528 1288.9296 1289.8266 1314.0359 1323.5457 1325.1373 1332.3383 1338.8951 1345.2612 1354.0131 1355.6766 1362.3528 1364.0932 1371.4189 1393.9842 1395.1714 1400.6445 1412.6484 1420.8839 1424.3440 1430.8605 1433.8749 1444.7109 1458.7293 1480.3083 1491.0970 1494.6999 1499.2751 1501.0069 1503.9747 1504.1687 1506.7704 1507.9072 1509.6064 1517.3790 1517.9750 1520.0119 1529.7088 1732.9480 2867.2668 2879.3197 2982.0694 3037.2447 3041.5262 3053.6659 3058.3554 3058.4724 3065.8334 3075.2952 3078.0558 3081.0147 3084.8503 3102.3522 3115.4113 3121.8742 3127.7452 3128.3586 3134.8653 3142.9906 3147.3977 3148.9969 3156.4224 3157.5465 3157.7586 3158.5025 3160.3144 3161.4052 3167.5792 3168.1880 3173.9122 3178.5365 3206.1445
redmass: 2.0662 2.7654 2.9588 2.6469 2.9460 2.5512 2.0672 1.9403 2.2873 1.1356 2.4433 2.4691 1.1220 1.8713 1.5318 1.4973 1.5893 1.5533 1.8126 2.7089 2.4137 2.7945 2.8700 2.2349 2.6907 2.4002 2.7823 2.6835 2.4750 2.8912 2.6706 2.8078 2.5315 2.6385 2.5463 2.9196 2.9914 2.8966 1.9718 2.7627 2.2468 1.4227 1.6765 1.7960 2.4828 1.9150 1.7967 1.7591 1.6387 1.2027 1.7193 1.6337 1.4824 1.5233 1.5323 1.7251 2.0154 1.5407 2.1379 2.1730 1.9334 2.1820 2.6418 1.7372 1.8378 2.2750 2.1256 1.7347 2.5152 1.5353 2.1830 1.7842 1.8573 1.7710 1.8548 2.0901 1.9008 1.8771 1.5606 1.6223 1.3597 1.2307 1.3789 1.3290 1.4393 1.3549 1.3451 1.5181 1.3183 1.1597 1.3270 1.3982 1.3398 1.2809 1.3757 1.5290 1.5925 1.5588 1.3097 1.5656 1.3287 1.3123 1.2278 2.0419 1.2717 1.0765 1.0602 1.1166 1.0578 1.0981 1.0715 1.0609 1.0551 1.0727 1.0894 1.0828 1.1067 1.0762 1.0486 8.7574 1.0722 1.0732 1.0816 1.0841 1.0506 1.0535 1.0630 1.0680 1.0481 1.0366 1.0437 1.0602 1.0663 1.0627 1.0680 1.0857 1.0950 1.0828 1.0980 1.0989 1.0998 1.1009 1.1015 1.0998 1.1025 1.1025 1.1039 1.0854 1.1005 1.1011 1.0898 1.0938 1.1044
irintensity: 6.5021 0.7629 1.1345 1.4497 1.2028 5.1292 0.2117 0.4621 7.9755 1.1310 1.4328 1.7495 0.3248 3.4441 1.3911 2.2048 1.5457 1.5759 1.0038 1.4837 1.2029 0.1213 2.2273 1.2171 7.5567 1.6804 5.2644 2.5974 2.6404 2.6276 4.2541 0.5385 1.1257 5.9953 0.9466 12.7469 0.9460 1.3349 17.7013 4.9799 8.1363 0.8042 3.4116 3.7641 1.5745 4.0013 1.5294 0.8066 5.8544 3.0072 12.7770 3.3088 2.6141 1.2332 6.9834 14.7672 4.2713 21.0504 14.9191 1.5795 2.3541 1.5186 4.3294 1.4669 5.0119 3.4241 5.1479 0.9942 3.3033 14.7550 0.9128 3.7933 16.2488 8.3963 2.6645 3.1611 16.9909 31.6333 3.8081 2.8144 9.3481 5.6052 0.5400 1.0511 0.6849 1.3999 0.4022 0.8946 22.5492 24.2666 3.7069 3.2055 22.9391 24.8929 2.6097 3.5298 0.9832 2.8360 8.5218 27.0201 48.5172 17.1392 3.7134 42.5523 8.0713 7.9545 3.8584 17.1119 0.2072 8.5795 9.9781 11.6611 7.0285 15.1943 8.6770 6.4818 12.2256 5.8599 21.0593 12.6645 87.0066 52.7521 31.1560 17.4347 21.5082 11.3407 14.7884 15.6673 29.2533 13.0975 8.6381 30.9096 17.6531 14.3692 14.5194 2.8531 7.5826 2.1613 16.1639 30.6331 9.3440 43.2262 36.2425 11.6652 7.7664 8.4881 21.8296 4.1270 29.5458 0.8006 11.4117 6.4093 5.2391
temp: 298.150 k
press: 1.00000 atm
elementType: 6 6 1 6 1 1 6 1 1 6 6 6 1 6 1 1 1 6 1 6 6 1 6 1 1 1 6 1 1 6 1 1 6 1 6 1 6 1 1 1 6 1 1 1 6 1 1 1 6 1 1 1 1
symmnumber: 1
zpe: 1285037.5 jmol-1
zpe.correction: 0.489445 hartree
zpe.thermalcorrener: 0.509866 hartree
zpe.thermalcorrenthalpy: 0.510810 hartree
zpe.thermalcorrgfe: 0.442848 hartree
zpe.sumelectzpe: -781.123339 hartree
zpe.sumelectthermal: -781.102917 hartree
zpe.sumelectthermalent: -781.101973 hartree
zpe.sumelectthermalfe: -781.169935 hartree
dipole: -5.1402 5.5266 0.4093
dipole: 7.5587
quadrupole: -87.3490 -99.5957 -116.0680
quadrupole: -9.9762 -0.2636 2.4144
quadrupole: 13.6553 1.4085 -15.0638 -9.9762 -0.2636 2.4144
hfenergy: -781.6127836 hartree
pointgroup: C01 [X(C20H33)]
dipole: -2.0287912 2.1648348 0.2025305 debye
polarizability: 266.8203714|0.3817052|209.1261229|0.4086628|2.0965909|178.8061143 unknown
InChI: InChI=1/20C.33H
charge 1 multiplicity 1
53 atoms
C  1.20211445 -0.32018933 -0.39897879
C  2.53694849 -0.1197861 0.40337527
H  2.43603937 0.82227699 0.97112541
C  2.52216098 -1.27204273 1.41994323
H  2.87858673 -2.19006715 0.93898394
H  3.17587949 -1.08587978 2.2726498
C  1.06179971 -1.41612231 1.83860385
H  0.79034899 -2.43817608 2.11533692
H  0.85518085 -0.79202121 2.71711755
C  0.26201285 -0.91622188 0.65506547
C  -1.07580399 -0.9754682 0.59512161
C  -0.03691381 1.93137984 0.0446303
H  -1.60363332 -1.40496314 1.4455844
C  0.66055249 1.01589739 -0.97270124
H  0.16691841 1.53687558 1.07188244
H  0.38474254 2.93990861 0.06628267
H  0.00085078 0.83250164 -1.82359697
C  -1.92035475 -0.48622406 -0.54492732
H  -1.35879231 -0.56377609 -1.47415981
C  -2.40633047 0.99581654 -0.33409415
C  -1.49125123 2.01307145 0.16126324
H  1.49637525 1.58637698 -1.37639479
C  -2.04660743 3.19069681 0.85631775
H  -2.33890638 2.86602867 1.86689031
H  -1.33921628 4.01297897 0.94813125
H  -2.97620371 3.52954419 0.39052088
C  -3.8433014 0.93745491 0.25893038
H  -3.90131029 1.40034082 1.24563239
H  -4.54479076 1.47464075 -0.38441455
C  -4.18194091 -0.55840571 0.32121318
H  -3.9621454 -0.95356209 1.3189254
H  -5.239345 -0.74989058 0.12781481
C  -3.27069038 -1.21871757 -0.71369789
H  -3.64652062 -0.94167544 -1.70913929
C  3.86570376 -0.03805717 -0.37775163
H  3.9829182 -0.98087044 -0.92803942
C  5.04745759 0.07253046 0.59279059
H  5.13818161 -0.79845921 1.2442239
H  5.98564819 0.16166659 0.03946768
H  4.9548446 0.96147111 1.22696453
C  3.95278675 1.10775719 -1.38966943
H  3.25841933 1.00104224 -2.22667191
H  3.77398525 2.07787955 -0.91104726
H  4.95590882 1.1468833 -1.82207648
C  1.39329966 -1.32783177 -1.5467281
H  2.04354622 -0.92467809 -2.3270236
H  1.83888389 -2.25773537 -1.18762803
H  0.43779097 -1.58727228 -2.00896707
C  -3.20112585 -2.73648352 -0.64119834
H  -2.86572819 -3.08315962 0.33939924
H  -4.18749685 -3.16909616 -0.82596793
H  -2.51696997 -3.14074082 -1.39160024
H  -2.47748895 1.41628632 -1.36982215
