program: Gaussian 16
title: phenonium ion with F
version: ES64L-G16RevC.01
method: RmPW1PW91
basis: 6-31+G(d,p)
operation: Freq
keyword: #N
keyword: Geom=AllCheck
keyword: Guess=TCheck
keyword: SCRF=Check
keyword: GenChk
keyword: RmPW1PW91/6-31+G(d,p)
keyword: Freq
converged: YES YES YES YES
title: Mulliken charges:
elementType: C C H C H H C H H C C C H C H H H C H C C H C H H H C H H C H H C C C H H H C H H H C H H H C H H H H H H
charge: -0.380740 -0.052012 0.203822 -0.463253 0.187861 0.193977 -0.256035 0.195785 0.188642 0.409098 -0.501133 -0.383698 0.179633 -0.475468 0.197138 0.168557 0.206128 -0.435314 0.153628 0.039694 0.432354 0.219332 -0.708148 0.163598 0.192068 0.178757 -0.498711 0.214801 0.195732 -0.203752 0.188277 0.180092 0.500272 0.159677 -0.595711 0.179785 0.199923 0.166218 -0.531214 0.183371 0.170697 0.196036 -0.423365 0.192190 0.202115 0.168700 -0.722999 0.194582 0.210673 0.147689 0.123193 0.159001 0.188460
chargesum: 1.00000
title: Mulliken charges with hydrogens summed into heavy atoms:
elementType: C C C C C C C C C C C C C C C C C C C C
charge: -0.380740 0.151810 -0.081415 0.128391 0.409098 -0.106700 -0.018004 -0.050008 -0.281686 0.162887 0.432354 -0.173725 -0.143977 0.164617 0.500272 0.348137 -0.049786 0.018890 0.139639 -0.170055
1716.lowfreq: 0.0004 0.0006 0.0008 3.4589 4.9043 8.2300 37.9290 50.4514 67.8614
frequency: 37.9159 50.4457 67.8542 85.1562 91.9442 106.8716 130.0632 158.5872 166.4313 168.0038 187.7634 194.6274 212.9756 231.3806 242.9254 257.4700 263.4325 284.5180 288.3246 293.5115 305.3870 318.0734 346.4724 356.0773 377.6427 392.4529 404.5649 420.3444 433.7682 445.5930 470.1504 505.8847 523.4080 539.4003 588.6905 606.8038 623.0656 674.9347 695.1918 718.5441 761.2148 783.0208 810.9466 853.0626 865.7812 875.0473 881.2471 899.0353 912.8977 925.2229 929.0667 939.4525 948.6567 954.2218 962.5194 971.9852 984.8624 991.2645 1003.6240 1018.4905 1032.7855 1042.6025 1047.4064 1052.9547 1062.5384 1096.2077 1098.1619 1113.7779 1134.6418 1147.1329 1153.5770 1172.1638 1179.6581 1184.1359 1189.7539 1197.3012 1209.3641 1218.7214 1222.2625 1245.5782 1253.4011 1257.2097 1272.7427 1298.5411 1309.9963 1316.1992 1328.2728 1332.5331 1349.5588 1356.8957 1357.8565 1361.8671 1399.5661 1400.7584 1407.0494 1408.1529 1418.1770 1431.9454 1435.2593 1437.1450 1437.9626 1451.0078 1473.4833 1481.0459 1486.5566 1487.2859 1490.2278 1492.3408 1495.4614 1495.9762 1500.6419 1505.0522 1508.0708 1511.9602 1514.7872 1516.4248 1518.6310 1521.3295 1700.6246 1759.7051 2910.5475 3050.2146 3064.3419 3068.2409 3072.2620 3073.9454 3075.0133 3079.6418 3085.2176 3088.4823 3089.8630 3093.2309 3095.5724 3105.5612 3111.2576 3128.5969 3130.5275 3142.3956 3146.2884 3148.6474 3150.2873 3152.7904 3155.8093 3158.9121 3161.3537 3161.7926 3162.8251 3167.5441 3173.1119 3180.7451 3181.5479 3192.6804 3205.7741
redmass: 3.5274 2.6424 2.8778 3.2332 3.1007 2.9197 2.1808 2.8517 1.3112 2.9006 2.5304 1.1849 2.2504 1.0876 2.3150 2.8766 1.7760 1.7535 2.1500 1.6705 1.4654 2.5189 2.2002 2.5470 2.0841 2.0752 2.2282 2.2734 2.7935 2.6457 2.3912 2.5038 2.5631 2.6996 2.3839 2.7789 2.9554 2.7014 2.1967 3.0625 2.7585 2.3958 2.8008 1.8216 2.0437 1.7732 1.7511 1.7587 2.1620 1.8386 1.7233 1.2490 2.0190 2.0481 2.1964 1.5094 1.9425 2.0523 1.6555 1.3883 1.7153 1.9468 1.6033 1.7063 1.5088 1.8439 1.9316 2.1022 1.7728 2.1561 1.8169 1.6374 1.6720 1.4998 1.6318 1.3499 1.4713 1.4142 1.2722 1.5880 1.5120 1.5990 1.5158 1.3801 1.6849 1.4583 1.2561 1.3153 1.4298 1.5228 1.4625 1.3807 1.2044 1.3692 1.2071 1.5005 1.2713 1.4945 1.4920 1.3512 1.3089 1.6581 1.1511 1.0618 1.0748 1.0594 1.0466 1.0889 1.0598 1.0728 1.0694 1.0799 1.1066 1.0991 1.0619 1.0528 1.0692 1.0844 6.0393 7.1684 1.0675 1.0442 1.0382 1.0377 1.0731 1.0470 1.0641 1.0606 1.0409 1.0767 1.0626 1.0718 1.0669 1.0673 1.0961 1.1003 1.1035 1.0989 1.0986 1.0998 1.1007 1.0915 1.1024 1.1007 1.0939 1.1019 1.0995 1.1023 1.1000 1.0972 1.0978 1.0891 1.0980
irintensity: 0.3405 0.0934 0.2025 0.3323 0.3670 0.6882 1.2375 1.8336 0.2450 7.0722 1.6168 0.0814 4.0171 0.3985 0.6446 1.7763 5.8603 0.6766 0.5431 1.0474 4.4077 0.3648 1.5059 2.4758 0.7125 0.5145 0.5532 0.5680 1.3524 3.4028 3.1971 11.0457 3.7124 1.4935 16.4227 8.0346 6.9173 32.3080 5.3512 58.7593 28.9759 7.1240 1.5541 2.5900 46.5421 5.8916 22.1692 9.9655 8.3298 1.1466 3.2763 0.6659 1.9894 10.0160 14.5344 0.2932 21.5995 12.9623 9.6225 61.2826 95.8120 2.3459 28.7530 1.9153 4.7955 30.6363 7.9635 7.0995 40.0560 15.3843 40.4660 40.0792 3.7904 3.8743 12.8093 6.3003 0.2213 26.1654 1.3142 26.2750 3.8308 3.2761 0.3671 1.7203 32.7459 2.2187 3.4125 15.2773 0.5862 3.9353 0.3823 2.1430 9.7298 7.2988 0.2881 5.9880 10.2926 12.0025 9.6763 25.4720 8.7085 31.4623 5.9725 5.8775 22.8162 4.1512 0.4195 11.2464 2.5036 18.6380 15.2319 21.0274 1.9660 10.4669 4.3461 18.9970 24.2909 14.8305 176.0899 2.5783 76.0639 19.4402 7.1075 10.7480 6.1671 6.2279 5.2865 12.3739 5.2408 1.7782 32.3531 21.7838 15.0056 12.4390 14.8677 2.5085 6.2819 3.7625 4.4208 4.9503 6.2881 5.7447 17.1431 18.2808 18.1580 5.3758 18.0902 12.2234 15.1530 11.6586 10.1218 5.5426 11.7827
temp: 298.150 k
press: 1.00000 atm
elementType: 6 6 1 6 1 1 6 1 1 6 6 6 1 6 1 1 1 6 1 6 6 1 6 1 1 1 6 1 1 6 1 1 6 6 6 1 1 1 6 1 1 1 6 1 1 1 6 1 1 1 1 1 1
symmnumber: 1
zpe: 1284703.9 jmol-1
zpe.correction: 0.489318 hartree
zpe.thermalcorrener: 0.511144 hartree
zpe.thermalcorrenthalpy: 0.512088 hartree
zpe.thermalcorrgfe: 0.440925 hartree
zpe.sumelectzpe: -781.096180 hartree
zpe.sumelectthermal: -781.074354 hartree
zpe.sumelectthermalent: -781.073409 hartree
zpe.sumelectthermalfe: -781.144573 hartree
dipole: 2.5225 -0.9618 0.6776
dipole: 2.7834
quadrupole: -85.3654 -109.5446 -114.9327
quadrupole: 1.9337 -2.4988 2.5204
quadrupole: 17.9155 -6.2637 -11.6518 1.9337 -2.4988 2.5204
hfenergy: -781.5854976 hartree
pointgroup: C01 [X(C20H33)]
dipole: 1.0081037 -0.3492251 0.2468392 debye
polarizability: 301.7207323|17.8186579|215.2175988|-2.8093457|6.8709178|183.2533664 unknown
InChI: InChI=1/20C.33H
charge 1 multiplicity 1
53 atoms
C  1.18270498 -0.00820341 -0.0402458
C  2.46389416 -0.02095335 0.69881912
H  2.33123685 0.3956519 1.70492369
C  2.92355116 -1.48733932 0.65527182
H  4.00752725 -1.58874151 0.71338033
H  2.50437095 -2.0438065 1.49838702
C  2.35393655 -1.97965604 -0.67236085
H  3.0043208 -1.68556688 -1.50250396
H  2.24666635 -3.06511365 -0.72618646
C  0.99613796 -1.25685749 -0.81128079
C  -0.09634251 -2.07783914 0.08442722
C  -0.63252387 1.79665565 -0.85921864
H  0.13989952 -1.98538046 1.14717218
C  0.17968782 1.01834325 0.23339967
H  -0.18773456 2.7928169 -0.94456429
H  -0.54992012 1.31312101 -1.83192271
H  0.55956464 1.71014235 0.98569107
C  -1.51759892 -1.79283668 -0.22101137
H  -1.79632188 -1.97694848 -1.25546542
C  -2.92023141 0.93467745 -0.91671579
C  -2.06947496 1.83141065 -0.39908491
H  -0.57914228 0.38038914 0.73810574
C  -2.36337216 2.73093397 0.76691222
H  -1.75673604 2.49028628 1.64900577
H  -2.1300796 3.76828761 0.50364915
H  -3.41123767 2.70128549 1.06446592
C  -4.15398705 0.37168571 -0.28524412
H  0.14217295 -3.10958618 -0.19794477
H  -5.03261792 0.44634616 -0.93387534
C  -3.88689313 -1.13743449 -0.00514134
H  -4.66993718 -1.52448774 0.65489565
H  -3.96642184 -1.68440294 -0.94916217
C  -2.51776302 -1.38700672 0.59470896
C  3.52550756 0.92621754 -0.01820321
C  2.98863019 2.29041856 -0.44155267
H  2.59082311 2.85302183 0.40875306
H  3.80527578 2.88250571 -0.86117263
H  2.21277357 2.22602963 -1.20865983
C  4.71967945 1.09833616 0.91982769
H  4.44025612 1.68212378 1.80202986
H  5.13827053 0.14913356 1.25864209
H  5.51476884 1.63928842 0.40033533
C  0.53638984 -1.16904673 -2.26672114
H  1.27328312 -0.62527636 -2.86221823
H  0.46374334 -2.18021865 -2.67613021
H  -0.43071406 -0.6864994 -2.38952388
C  -2.39584701 -1.14840894 2.06882515
H  -2.7737269 -0.15612652 2.33554323
H  -3.02045433 -1.86871075 2.60815898
H  -1.37880753 -1.24516277 2.45300029
H  -2.58494927 0.38878859 -1.79846228
H  -4.3984139 0.88939019 0.64472648
H  3.85460272 0.39112759 -0.91578687
