program: Gaussian 16
title: Title Card Required
version: ES64L-G16RevC.01
frameworkgroup: C1[X(C39H40O33Zr6)]
method: RM06L
basis: Gen
operation: Freq
keyword: #p
keyword: freq=noraman
keyword: gen
keyword: integral=grid=ultrafine
keyword: m06l
keyword: pseudo=read
keyword: scf=(intrep,xqc,maxconventionalcycles=150)
title: #p freq=noraman gen integral=grid=ultrafine m06l pseudo=read scf=(intr
basis: NPDir=0 NMtPBC= 1 NCelOv= 1 NCel= 1 NClECP= 1 NCelD= 1
basis: NCelK= 1 NCelE2= 1 NClLst= 1 CellRange= 0.0.
basis: One-electron integrals computed using PRISM.
basis: One-electron integral symmetry used in STVInt
converged: YES YES YES YES
title: Mulliken charges:
elementType: Zr Zr Zr Zr Zr Zr O O O O O O O O O O O O O O O O O O O O O O O O O O O O O O C C C C C C C C C C C C C C C C C C C C C C C C C C C C C C C C C C C H H H H H H H H H H H H H H H H H H H H H H H H O H H H H H H H H C O C H H H H C H C H H H O
charge: 1.611033 1.583512 1.570714 1.666696 1.472118 1.674223 -0.621049 -0.488130 -0.454342 -0.476061 -0.852487 -0.452235 -0.859084 -0.621584 -0.452607 -0.483537 -0.455324 -0.489418 -0.451629 -0.478884 -0.482776 -0.619688 -0.449356 -0.860085 -0.671712 -0.454841 -0.454470 -0.451205 -0.488211 -0.454464 -0.456366 -0.451260 -0.861437 -0.489671 -0.455124 -0.452770 -0.020639 -0.110615 -0.032333 0.547483 -0.032217 0.456109 -0.022039 -0.023378 -0.031963 -0.017776 -0.112541 -0.032036 0.554946 -0.022884 -0.026757 0.457337 -0.132161 0.565334 -0.008468 -0.023549 -0.032430 -0.021136 -0.032724 0.455074 0.452349 0.455243 -0.024135 0.595708 -0.022810 0.458252 -0.100489 -0.034901 -0.034407 0.462844 -0.025141 0.061092 0.041787 0.250267 0.042398 0.061745 0.043059 0.043018 0.062138 0.066133 0.253283 0.064998 0.043031 0.066102 0.041782 0.331556 0.245940 0.063370 0.063170 0.039988 0.039977 0.046372 0.045639 0.043396 0.045789 -0.333034 0.281846 0.042252 0.040391 0.040044 0.040170 0.040423 0.039803 0.041906 0.225427 -0.476032 -0.167006 0.061533 0.046559 0.248654 0.039742 0.153290 0.029000 -0.051514 0.058453 0.046526 0.074312 -0.500413
chargesum: -0.00000
polarizability: 8.53049399e+02 -7.67533376e+00 6.85537151e+02 6.17843984e+00 -2.94012574e+00 6.78163576e+02
redmass: 8.4277 9.6073 4.5018 6.8619 7.0489 7.9811 5.3069 10.6568 3.9532 9.3964 6.4638 4.3242 4.4916 4.9754 6.8547 6.7759 9.2837 9.6471 9.5091 5.8923 7.2995 7.9692 7.8271 6.7032 7.0203 6.3899 6.9337 7.7319 6.0557 5.4872 17.4056 9.9241 8.5744 7.1148 7.3734 10.1907 7.8193 11.5447 9.5193 12.1430 8.3019 7.6323 10.1721 11.4297 8.9508 11.8547 9.6905 10.1909 12.8667 15.8893 12.5361 16.9353 9.3757 11.1534 10.6929 11.4333 10.6667 9.6904 8.7374 10.3335 11.2600 12.1018 10.1213 9.9489 13.1673 10.8137 1.3420 11.7213 5.4484 3.5219 3.3258 3.4901 5.0606 3.6358 4.6270 4.4363 4.3025 5.9667 8.2448 6.4074 3.9135 7.6158 8.6459 8.7392 7.9082 9.2671 7.9699 8.4852 7.4023 8.5043 8.3630 7.7683 8.9718 8.6809 10.3963 10.0675 10.3050 9.7709 10.4757 10.8313 10.3699 7.4674 5.6745 5.3263 4.7771 4.2468 5.1431 7.4387 7.4138 4.8304 9.3610 5.3252 2.9844 2.9083 3.7426 2.9286 6.8303 6.5103 7.1455 6.9736 3.8562 7.0411 7.0480 5.3663 1.9771 8.3556 8.5626 7.6892 5.3669 2.1873 3.1013 11.0538 11.2670 10.5871 7.0313 6.8851 6.7900 6.8004 7.8569 9.6524 7.6071 8.6218 9.3680 8.3875 8.5480 8.6193 3.4181 3.3114 3.3767 3.5743 12.6827 11.1404 11.7674 10.9560 11.3337 1.1726 1.2845 1.2826 1.2706 1.2856 1.8752 1.5974 2.2155 2.3643 3.2994 4.0331 11.3797 4.6966 2.3158 2.6762 1.9406 1.9195 5.7883 5.8909 3.6977 2.6498 3.5796 3.0084 1.5915 2.7341 1.4945 1.5166 3.2149 3.1700 3.1139 3.1825 1.2515 1.2519 1.2516 1.2712 1.3185 6.8330 6.2729 6.6568 6.7107 1.4557 1.4564 1.4949 1.4962 1.4283 1.1771 1.4153 1.5041 1.2484 1.2547 1.2993 1.2524 1.3581 1.3653 1.3697 1.3187 1.1017 2.3162 2.3324 2.3378 2.3386 1.4075 1.6986 1.6996 1.7019 1.7003 1.7055 1.7052 1.7092 1.5701 1.2035 1.2087 1.2079 1.2081 1.0932 1.6386 1.3271 1.2914 1.2994 1.3330 2.6273 2.7319 2.6058 2.7142 1.1043 1.1040 1.1043 1.1032 1.7977 1.4983 1.4918 1.4905 1.4911 1.2577 1.4238 1.2003 1.1198 1.1151 1.1142 1.1131 1.1102 1.1094 1.1114 1.7822 2.1708 8.4491 9.7557 9.7204 9.5363 9.0637 1.0911 9.2730 2.4124 2.5249 3.3685 3.3236 3.2821 3.3290 3.3562 2.9918 2.6748 3.8467 4.3003 4.5937 5.9341 3.4734 6.5353 6.1839 6.2445 6.1919 8.4981 9.1267 9.1802 10.5955 8.7931 6.3341 6.2560 6.2267 6.2667 7.5446 2.1507 2.8822 3.7438 10.3565 10.9226 10.7692 10.7567 1.0738 1.0893 1.0860 1.0856 1.0856 1.0858 1.0859 1.0860 1.0863 1.0864 1.0395 1.0080 1.0079 1.0079 1.0079 1.1000 1.0600 1.1056 1.0893 1.0893 1.0892 1.0889 1.0892 1.0890 1.0887 1.0889 1.0954 1.0950 1.0952 1.0957 1.0951 1.0959 1.0957 1.0950 1.1132 1.0701 1.0654 1.0663 1.0663 1.0663
temp: 298.150 k
press: 1.00000 atm
elementType: 40 40 40 40 40 40 8 8 8 8 8 8 8 8 8 8 8 8 8 8 8 8 8 8 8 8 8 8 8 8 8 8 8 8 8 8 6 6 6 6 6 6 6 6 6 6 6 6 6 6 6 6 6 6 6 6 6 6 6 6 6 6 6 6 6 6 6 6 6 6 6 1 1 1 1 1 1 1 1 1 1 1 1 1 1 1 1 1 1 1 1 1 1 1 1 8 1 1 1 1 1 1 1 1 6 8 6 1 1 1 1 6 1 6 1 1 1 8
symmnumber: 1
zpe: 2076661.7 jmol-1
zpe.correction: 0.790959 hartree
zpe.thermalcorrener: 0.868647 hartree
zpe.thermalcorrenthalpy: 0.869592 hartree
zpe.thermalcorrgfe: 0.684336 hartree
zpe.sumelectzpe: -4273.317485 hartree
zpe.sumelectthermal: -4273.239796 hartree
zpe.sumelectthermalent: -4273.238852 hartree
zpe.sumelectthermalfe: -4273.424108 hartree
dipole: 0.4847 5.1167 2.5960
dipole: 5.7580
quadrupole: -482.8454 -505.0318 -513.1803
quadrupole: 0.3549 -3.8803 2.8420
quadrupole: 17.5072 -4.6793 -12.8278 0.3549 -3.8803 2.8420
hfenergy: -4274.1084439 hartree
pointgroup: C01 [X(C39H40O33Zr6)]
dipole: 0.1906883 2.0130809 1.0213262 debye
polarizability: 853.0493996|-7.6753298|685.5371503|6.1784399|-2.9401256|678.1635758 unknown
InChI: InChI=1/39C.33O.6Zr.40H
charge 0 multiplicity 1
118 atoms
Zr -2.740634 -0.509464 -0.381587
Zr 2.241712 -1.107581 -0.638737
Zr 0.040528 1.665741 -0.835786
Zr -0.414661 -1.130332 -3.015676
Zr -0.074287 -0.564799 1.969147
Zr -0.539521 -3.319573 -0.213599
O  -1.587138 0.561069 -2.02617
O  -3.574302 1.542434 -0.550923
O  -2.45497 -1.08594 -3.944096
O  -1.825643 2.918333 -0.852813
O  -1.106993 0.486042 0.467396
O  -3.930347 -0.700448 -2.283545
O  -1.470674 -1.853839 -1.364219
O  -1.725645 -1.88968 1.133805
O  -4.02157 -2.346317 -0.148552
O  -3.659275 -0.110326 1.606625
O  -2.627373 -4.115591 -0.044849
O  -1.962957 -0.060922 3.077852
O  -0.771124 -3.198777 -3.810796
O  2.114782 2.380069 -1.283675
O  3.523277 0.655526 -1.023111
O  0.898995 -2.566928 -1.820848
O  0.0425 2.452474 -2.949654
O  0.826737 -0.050772 -1.742569
O  1.365537 0.604702 0.643895
O  1.484635 -1.43083 -4.166126
O  -0.208955 0.678497 -4.317345
O  3.168769 -1.442125 -2.666534
O  1.941824 -0.729765 2.896597
O  -0.848905 -4.582357 -2.033699
O  1.312752 -4.57551 -0.115001
O  3.069672 -3.186379 -0.382675
O  0.72945 -1.871487 0.585613
O  3.405092 -1.031708 1.225638
O  -0.193652 -2.383842 3.264853
O  -0.472006 -4.135175 1.874518
C  -5.379748 3.642328 -0.828944
C  -3.994688 3.836693 -0.907889
C  -4.358716 6.187714 -1.354408
C  -3.062778 2.685186 -0.749819
C  -6.24704 4.714779 -1.015597
C  -3.610197 -0.948694 -3.471309
C  -3.489221 5.117392 -1.168044
C  -5.738039 5.986993 -1.282025
C  -4.540707 1.047351 6.159225
C  -5.476996 0.710392 3.550032
C  -4.124232 0.489745 3.840666
C  -6.353677 1.098034 4.559156
C  -3.181849 0.078402 2.763019
C  -5.887374 1.266364 5.864293
C  -3.660987 0.661666 5.152105
C  -3.758944 -3.571635 -0.083091
C  4.401743 2.744232 -1.689186
C  3.263426 1.859336 -1.311775
C  4.158653 4.064105 -2.092719
C  6.531972 4.440216 -2.312787
C  6.779679 3.122438 -1.922678
C  5.71927 2.274874 -1.615357
C  5.220693 4.908528 -2.40249
C  -0.929233 -4.314114 -3.258115
C  -0.015682 1.895189 -4.071958
C  2.693381 -1.478036 -3.827142
C  5.566119 -0.878974 2.954146
C  3.117033 -0.832633 2.441981
C  4.004094 -0.442423 4.752051
C  2.538203 -4.300767 -0.160511
C  4.248471 -0.716863 3.400751
C  5.065873 -0.33959 5.64622
C  6.625873 -0.777894 3.850872
C  -0.301167 -3.607131 2.999979
C  6.377201 -0.511965 5.19829
H  -2.407563 5.251866 -1.2281
H  -3.961298 7.183952 -1.561148
H  -2.113178 1.114427 -2.612975
H  -7.326671 4.559492 -0.956984
H  -5.758378 2.638739 -0.626255
H  -4.176388 1.177826 7.180678
H  -7.407449 1.270352 4.328991
H  -5.822591 0.573692 2.523591
H  -2.604666 0.484465 5.363537
H  -2.31635 -2.286045 1.78305
H  3.125425 4.411312 -2.158929
H  7.806765 2.756277 -1.857785
H  5.891341 1.242752 -1.303243
H  5.026746 5.936533 -2.716722
H  2.005609 1.183561 1.120582
H  1.360995 -3.243031 -2.327511
H  5.739691 -1.089117 1.897171
H  2.97165 -0.313141 5.082752
H  4.872354 -0.127003 6.700148
H  7.651913 -0.910092 3.499955
H  -6.577286 1.569657 6.655481
H  -6.420461 6.827108 -1.43212
H  7.209194 -0.435471 5.902657
H  7.366451 5.103819 -2.552132
O  0.264368 1.360174 3.141256
H  1.169159 1.779816 2.949259
H  -0.250413 -4.302087 3.865822
H  0.105436 2.558031 -4.956416
H  3.234256 -5.151918 0.004489
H  3.428634 -1.574615 -4.655585
H  -4.632135 -4.258705 -0.042975
H  -4.448899 -1.048468 -4.194394
H  -1.157613 -5.168162 -3.931948
C  0.904655 4.224459 1.198046
O  0.339427 3.197339 0.718653
C  2.239975 4.580973 1.037762
H  2.534669 5.574826 1.384376
H  2.772018 4.19333 0.167325
H  -0.398589 2.023207 2.908089
H  0.305415 4.805638 1.933514
C  3.11572 3.343396 2.429847
H  2.845877 3.998822 3.287285
C  4.547699 3.477052 1.99502
H  4.728056 2.935454 1.05673
H  4.872168 4.519341 1.881196
H  5.174881 3.002034 2.766999
O  2.579335 2.193203 2.379919
