program: Gaussian 16
title: Title Card Required
version: ES64L-G16RevC.01
frameworkgroup: C1[X(C37H36O32Zr6)]
method: RM06L
basis: Gen
operation: Freq
keyword: #p
keyword: freq=noraman
keyword: gen
keyword: integral=grid=ultrafine
keyword: m06l
keyword: pseudo=read
keyword: scf=(intrep,xqc,maxconventionalcycles=150)
title: #p freq=noraman gen integral=grid=ultrafine m06l pseudo=read scf=(intr
basis: NPDir=0 NMtPBC= 1 NCelOv= 1 NCel= 1 NClECP= 1 NCelD= 1
basis: NCelK= 1 NCelE2= 1 NClLst= 1 CellRange= 0.0.
basis: One-electron integrals computed using PRISM.
basis: One-electron integral symmetry used in STVInt
converged: YES YES YES YES
title: Mulliken charges:
elementType: Zr Zr Zr Zr Zr Zr O O O O O O O O O O O O O O O O O O O O O O O O O O O O O O C C C C C C C C C C C C C C C C C C C C C C C C C C C C C C C C C C C H H H H H H H H H H H H H H H H H H H H H H H H H H H H H H C O C H H H H O H H
charge: 1.638775 1.623150 1.489281 1.676377 1.460555 1.669915 -0.617400 -0.488119 -0.453451 -0.478877 -0.851566 -0.455057 -0.858170 -0.619205 -0.452918 -0.478577 -0.455180 -0.508437 -0.452288 -0.480858 -0.480896 -0.616387 -0.447421 -0.855402 -0.824218 -0.458475 -0.457383 -0.447183 -0.494251 -0.454556 -0.457656 -0.449295 -0.858173 -0.479205 -0.452572 -0.455390 -0.021587 -0.113296 -0.033760 0.552943 -0.032526 0.458446 -0.021031 -0.022960 -0.029891 -0.015615 -0.105933 -0.030573 0.548232 -0.022577 -0.035824 0.456984 -0.106766 0.564749 -0.035568 -0.023588 -0.031566 -0.018182 -0.029645 0.456433 0.454929 0.453465 -0.019992 0.583046 -0.024326 0.457592 -0.113713 -0.033054 -0.033072 0.456702 -0.023466 0.065477 0.042503 0.256637 0.041991 0.060287 0.044575 0.045030 0.064109 0.058143 0.249711 0.061515 0.043232 0.065437 0.042421 0.245003 0.063946 0.060839 0.041093 0.041570 0.048127 0.045862 0.045030 0.046019 0.039106 0.038267 0.039119 0.038704 0.040040 0.040220 0.041717 0.255101 -0.505761 -0.265726 0.306518 0.130510 0.084394 0.059498 -0.305534 0.257281 0.243490
chargesum: -0.00000
polarizability: 8.15898600e+02 7.00099040e+00 6.65759305e+02 1.05783806e+01 -2.13383863e+00 6.42201124e+02
redmass: 1.1173 10.7881 3.7552 10.6692 9.9300 13.5445 12.3343 4.2087 3.8464 3.8321 14.0515 7.9302 7.3224 8.0079 9.3547 10.2532 8.5022 7.9406 7.6525 7.8316 7.9363 6.5271 6.9807 6.2806 5.7764 7.0593 6.8224 7.8646 14.9814 5.2873 9.6292 15.6919 11.1563 10.2462 11.3201 9.9008 8.8646 14.3218 11.7747 12.5824 8.9020 12.6463 12.0939 13.0202 13.3865 10.9082 11.3537 16.9597 9.0949 9.3642 10.6653 9.8496 9.8713 11.5196 10.4779 10.5761 10.0263 10.4935 10.9176 11.1622 14.2403 13.0571 9.2497 6.4382 4.3356 5.3893 4.8818 3.8134 4.6809 4.6354 9.4893 4.4508 7.9140 8.2325 4.6287 6.8144 9.1217 8.3442 8.1318 8.8559 8.5242 8.8824 8.2783 8.9421 7.8768 8.5083 8.6266 8.6800 9.3245 10.4160 9.3477 9.9368 9.2630 9.8281 10.5526 8.7896 4.0537 5.2726 4.6014 4.1151 3.4974 12.9451 5.1156 6.0258 7.9815 7.9018 3.0880 2.9003 2.9426 3.0102 6.4072 6.1402 9.3016 7.0444 8.2514 7.8990 8.2117 7.5799 9.0561 8.7951 7.5571 1.2036 3.0690 9.5762 7.9891 6.9865 7.5456 7.6349 6.1583 9.3086 6.4435 8.2254 8.4147 6.7938 7.6612 9.0676 8.4422 10.4130 2.6051 1.5623 3.3090 3.3714 3.4728 3.2975 9.9867 10.6630 7.5827 3.6867 8.8374 1.3019 1.2861 1.3139 1.3259 1.6099 1.6663 2.0409 1.6684 2.3260 2.7637 2.0657 11.3980 5.0437 2.9944 2.5244 2.0942 1.9812 4.1278 3.8682 3.4065 3.0062 4.3918 2.7969 2.8775 2.8566 2.4690 1.2268 3.2081 3.2348 3.1953 3.2015 1.2489 1.2520 1.2475 1.2500 1.0864 6.9685 7.2245 7.0823 6.8941 1.5000 1.5052 1.4648 1.4909 1.2575 1.2735 1.2804 1.3507 1.2541 1.3401 1.3796 1.3397 1.5132 2.3296 2.3425 2.3371 2.3376 1.6988 1.7024 1.7037 1.7051 1.7009 1.7049 1.7077 1.7087 1.2104 1.2099 1.2074 1.2067 1.3767 1.3395 1.3041 1.3513 2.4649 2.5483 2.5031 2.7215 1.1031 1.1026 1.1039 1.1032 1.8909 1.4974 1.4932 1.4918 1.4918 1.1162 1.3263 1.1205 1.1205 1.1165 1.1172 1.1102 1.1150 1.1162 8.8935 8.8427 9.7005 9.7644 9.5545 9.6102 9.3112 1.5719 3.7879 3.4092 3.2175 3.1067 3.3197 2.7753 3.2656 2.7325 3.5919 3.9210 4.3305 4.7950 1.1882 6.5597 6.1720 6.2274 5.4518 7.5208 8.5625 5.9267 5.8065 7.2807 8.8692 6.2875 6.2598 6.2379 5.9969 1.3898 6.3316 10.5521 10.2496 10.5943 10.7649 10.7786 1.0854 1.0858 1.0856 1.0858 1.0858 1.0859 1.0864 1.0883 1.0079 1.0079 1.0079 1.0079 1.0605 1.0884 1.0892 1.0893 1.0892 1.0891 1.0888 1.0893 1.0893 1.0962 1.0955 1.0950 1.0949 1.0954 1.0951 1.0952 1.0952 1.1129 1.0656 1.0670 1.0663 1.0663 1.0663
irintensity: 3015.5501 0.0014 0.0098 0.0400 0.0048 0.0470 0.0443 0.0127 0.0331 0.0186 0.5816 0.0586 0.0414 0.1495 0.1580 0.1512 0.2745 0.5185 0.6932 0.8275 0.2128 0.0986 0.5981 0.9093 1.4369 0.5095 0.7621 0.2514 0.6145 0.2402 0.0817 1.9240 2.3474 0.7913 0.3800 0.6892 5.5459 0.0750 1.9488 8.3499 0.1166 2.4680 6.4167 5.8358 0.4138 7.6751 1.0805 0.1580 2.3370 1.1969 7.2488 7.5038 4.4400 3.8695 3.0788 2.2755 4.6582 1.3238 7.3458 0.2814 8.4689 1.1546 13.0379 1.5201 0.8752 1.7017 2.8785 0.2985 8.5698 1.4077 37.9021 0.5461 4.2698 0.5578 1.7140 8.5964 2.8157 1.8088 2.5223 3.1604 30.7652 4.4035 9.6037 18.0771 12.0240 9.6067 12.2648 2.7627 16.5770 5.2548 9.5381 24.7135 57.7679 251.4685 278.9040 159.4429 8.6307 63.9331 4.8371 7.0849 19.8472 18.9841 20.1798 38.8167 54.1070 165.7556 15.5484 0.2579 0.7508 8.6656 21.8593 1.7654 63.2469 41.4454 17.5602 149.2862 67.8484 68.7870 136.2415 348.1573 244.5007 107.3706 73.4811 26.8472 5.7458 5.6020 24.7113 19.4707 4.8474 48.0212 158.4333 7.3718 29.9736 19.1107 5.3128 37.8203 9.9411 3.0114 21.4102 248.5187 17.1626 6.5687 5.6805 10.8942 403.7596 106.9728 394.7966 191.4864 144.1132 55.5922 78.0320 65.0933 193.5653 15.0773 92.0702 76.9155 92.3851 145.4672 119.8358 106.3419 16.7613 15.4541 39.0558 1.9303 2.4863 20.7684 27.3503 12.6399 2.7404 3.6378 1.2852 10.9626 6.8277 1.7125 5.4245 26.1305 1.2790 1.3239 1.0427 0.8945 0.3460 0.0196 1.6503 0.1092 72.6524 0.2867 1.3880 1.6607 0.8460 1.2596 1.4329 1.5265 3.7540 0.0307 0.0515 0.0455 0.2200 0.2252 0.0883 1.2446 0.1698 19.1416 14.3073 11.1915 24.5650 10.6224 1.5355 0.2439 0.4935 0.3044 0.9044 1.1568 0.5663 0.0078 3.6053 3.4139 4.7316 4.2481 6.3832 6.5171 11.7743 6.6895 21.4540 22.6552 29.6297 17.8971 2.4264 2.3160 2.3613 2.4514 11.5359 0.2422 0.0830 0.0143 0.0871 45.9103 53.5556 3.7050 13.2591 14.9829 10.0840 36.7288 16.8316 36.6073 0.1835 46.7095 5.9461 50.2355 295.3149 440.1433 804.6658 261.2121 365.5042 40.5993 575.5416 684.6689 150.1946 456.3357 112.1659 287.1797 260.3814 470.2821 571.5914 373.6833 217.9155 37.3080 32.0141 39.5647 37.0971 112.6122 13.7260 378.4421 96.7422 11.7914 62.1304 34.5304 31.3170 42.8324 30.8128 37.9811 12.0232 432.2361 496.0922 1488.2798 1241.4631 695.4160 50.8270 201.2929 70.2138 159.7449 140.7120 96.3410 274.9189 57.7175 13.5031 14.2637 12.0483 13.3761 4.2728 9.1261 12.5592 10.8793 10.1788 9.7291 9.7263 10.5540 10.1135 7.7258 6.7730 6.6020 5.1400 5.1470 5.0966 5.2121 6.9623 4.0791 466.1911 209.7662 68.3905 84.9968 42.5053
temp: 298.150 k
press: 1.00000 atm
elementType: 40 40 40 40 40 40 8 8 8 8 8 8 8 8 8 8 8 8 8 8 8 8 8 8 8 8 8 8 8 8 8 8 8 8 8 8 6 6 6 6 6 6 6 6 6 6 6 6 6 6 6 6 6 6 6 6 6 6 6 6 6 6 6 6 6 6 6 6 6 6 6 1 1 1 1 1 1 1 1 1 1 1 1 1 1 1 1 1 1 1 1 1 1 1 1 1 1 1 1 1 1 6 8 6 1 1 1 1 8 1 1
symmnumber: 1
zpe: 1910933.0 jmol-1
zpe.correction: 0.727836 hartree
zpe.thermalcorrener: 0.801391 hartree
zpe.thermalcorrenthalpy: 0.802336 hartree
zpe.thermalcorrgfe: 0.626025 hartree
zpe.sumelectzpe: -4119.639164 hartree
zpe.sumelectthermal: -4119.565608 hartree
zpe.sumelectthermalent: -4119.564664 hartree
zpe.sumelectthermalfe: -4119.740974 hartree
dipole: 0.8351 0.0978 -5.3293
dipole: 5.3952
quadrupole: -463.7356 -492.6155 -494.7307
quadrupole: -3.4640 -2.4240 1.3815
quadrupole: 19.9583 -8.9216 -11.0367 -3.4640 -2.4240 1.3815
hfenergy: -4120.3669995 hartree
pointgroup: C01 [X(C37H36O32Zr6)]
dipole: 0.3285717 0.0384919 -2.0967152 debye
polarizability: 815.8986004|7.0009886|665.7593047|10.5783806|-2.1338388|642.2011239 unknown
InChI: InChI=1/37C.32O.6Zr.36H
charge 0 multiplicity 1
111 atoms
Zr 2.579894 -0.051997 0.79778
Zr -2.431648 -0.105109 0.833638
Zr -0.025955 1.769144 -0.806811
Zr 0.081881 1.596989 2.748479
Zr 0.0087 -1.726249 -0.984904
Zr 0.111295 -1.961498 2.550249
O  1.46118 1.923325 0.938872
O  3.57594 1.389527 -0.581114
O  2.078257 2.259181 3.52839
O  1.930576 2.479576 -1.658951
O  1.118577 0.013691 -0.683846
O  3.657914 1.227663 2.294431
O  1.131642 -0.155595 2.304168
O  1.490636 -2.062232 0.723479
O  3.67495 -1.47321 2.157581
O  3.621935 -1.345111 -0.694376
O  2.11377 -2.675733 3.253748
O  2.0182 -2.378165 -1.884486
O  0.193838 0.818324 4.847813
O  -2.040155 2.696785 -1.237346
O  -3.591179 1.347575 -0.347358
O  -1.309555 -0.212864 2.876859
O  -0.009854 3.902682 -0.035535
O  -0.988945 1.393745 0.9840
O  -1.339491 0.047261 -1.152476
O  -1.889973 2.312129 3.515851
O  0.001635 3.766518 2.215548
O  -3.482021 1.240969 2.327691
O  -1.902663 -2.497475 -1.795933
O  0.207782 -1.431629 4.720594
O  -1.857406 -2.796481 3.214094
O  -3.463423 -1.629664 2.140073
O  -0.971796 -1.593909 0.804371
O  -3.483465 -1.492034 -0.561759
O  -0.000885 -3.929847 -0.480451
O  0.05893 -4.060872 1.770182
C  5.53522 2.880017 -1.866173
C  4.170702 3.069905 -2.124332
C  4.728621 4.848426 -3.671079
C  3.149634 2.24823 -1.410933
C  6.486866 3.671458 -2.503562
C  3.261511 1.967879 3.228149
C  3.774301 4.058576 -3.034908
C  6.086601 4.659869 -3.404989
C  4.890245 -4.231751 -4.27808
C  5.61908 -2.3710 -2.326543
C  4.272609 -2.721541 -2.490787
C  6.592902 -2.945569 -3.136982
C  3.230736 -2.10199 -1.626132
C  6.229151 -3.875719 -4.111758
C  3.913733 -3.655733 -3.471621
C  3.291751 -2.324141 2.996484
C  -4.308417 3.147098 -1.687526
C  -3.236697 2.343568 -1.039252
C  -3.984227 4.312137 -2.39516
C  -6.314406 4.635688 -2.930071
C  -6.643155 3.476389 -2.226126
C  -5.644291 2.734497 -1.603483
C  -4.985874 5.054634 -3.013024
C  0.257503 -0.336788 5.333925
C  -0.05762 4.383279 1.121314
C  -3.076744 2.069141 3.176435
C  -5.520882 -2.784325 -1.938462
C  -3.110582 -2.270192 -1.482481
C  -3.827221 -3.851015 -3.298146
C  -3.046059 -2.542776 2.891406
C  -4.169984 -2.977969 -2.257301
C  -4.821336 -4.522047 -4.005914
C  -6.512435 -3.457672 -2.646731
C  -0.024651 -4.544374 0.613554
C  -6.165791 -4.329923 -3.680498
H  2.708597 4.197312 -3.226932
H  4.4125 5.619522 -4.377332
H  2.008583 2.715576 0.95332
H  7.548317 3.52025 -2.29432
H  5.831928 2.108281 -1.153474
H  4.608948 -4.96324 -5.038773
H  7.641782 -2.66903 -3.009647
H  5.881331 -1.64284 -1.556911
H  2.862234 -3.928122 -3.582473
H  2.049479 -2.842759 0.647908
H  -2.938984 4.625767 -2.441297
H  -7.684298 3.15235 -2.162516
H  -5.878076 1.82616 -1.045079
H  -4.732777 5.965395 -3.560324
H  -1.87458 -0.264998 3.654867
H  -5.773766 -2.103282 -1.12366
H  -2.771509 -3.996463 -3.535486
H  -4.547366 -5.202988 -4.815038
H  -7.563216 -3.304833 -2.390092
H  6.995498 -4.327559 -4.746224
H  6.833731 5.283083 -3.902096
H  -6.944215 -4.860096 -4.234299
H  -7.100327 5.218534 -3.416661
H  -0.118476 -5.650737 0.553844
H  -0.14924 5.489304 1.192045
H  -3.821228 -3.202762 3.338722
H  -3.860559 2.654623 3.705344
H  4.09105 -2.836523 3.575126
H  4.053804 2.428254 3.857687
H  0.361184 -0.39931 6.438854
C  -1.508646 1.580617 -3.550422
O  -0.304408 1.593348 -3.134924
C  -2.325821 0.434612 -3.544009
H  -2.071459 0.204611 -2.267901
H  -1.891068 -0.524729 -3.845274
H  -3.361785 0.576642 -3.866432
H  -1.973376 2.564944 -3.760186
O  0.249162 -1.083896 -3.242756
H  0.203357 -0.095446 -3.284404
H  1.1617 -1.323701 -3.458245
