program: Gaussian 16
title: Title Card Required
version: ES64L-G16RevC.01
frameworkgroup: C1[X(C37H36O32Zr6)]
method: RM06L
basis: Gen
operation: Freq
keyword: #p
keyword: freq=noraman
keyword: gen
keyword: integral=grid=ultrafine
keyword: m06l
keyword: pseudo=read
keyword: scf=(intrep,xqc,maxconventionalcycles=150)
title: #p freq=noraman gen integral=grid=ultrafine m06l pseudo=read scf=(intr
basis: NPDir=0 NMtPBC= 1 NCelOv= 1 NCel= 1 NClECP= 1 NCelD= 1
basis: NCelK= 1 NCelE2= 1 NClLst= 1 CellRange= 0.0.
basis: One-electron integrals computed using PRISM.
basis: One-electron integral symmetry used in STVInt
converged: YES YES NO YES
title: Mulliken charges:
elementType: Zr Zr Zr Zr Zr Zr O O O O O O O O O O O O O O O O O O O O O O O O O O O O O O C C C C C C C C C C C C C C C C C C C C C C C C C C C C C C C C C C C H H H H H H H H H H H H H H H H H H H H H H H H O H H H H H H H H C O C H H H H
charge: 1.598227 1.608120 1.608151 1.655547 1.438910 1.660799 -0.622548 -0.488163 -0.452080 -0.474351 -0.853630 -0.453883 -0.858343 -0.622262 -0.451685 -0.476471 -0.455609 -0.490180 -0.449724 -0.464710 -0.497584 -0.620782 -0.448512 -0.857750 -0.609826 -0.452682 -0.457170 -0.454029 -0.492040 -0.455983 -0.455660 -0.451145 -0.861596 -0.478909 -0.455490 -0.450135 -0.021331 -0.100137 -0.031664 0.540795 -0.033922 0.457064 -0.012769 -0.023389 -0.031870 -0.016526 -0.112207 -0.033332 0.550291 -0.021868 -0.020411 0.456617 -0.114220 0.553479 -0.021261 -0.023651 -0.033223 -0.022115 -0.032704 0.454941 0.455779 0.457567 -0.018870 0.555378 -0.031682 0.456791 -0.110188 -0.031069 -0.031187 0.458247 -0.022807 0.062112 0.040900 0.249405 0.040886 0.059834 0.042610 0.043594 0.063012 0.063199 0.254009 0.068951 0.041273 0.061120 0.041985 0.261498 0.246852 0.065562 0.063177 0.043285 0.044035 0.046729 0.044197 0.047067 0.044846 -0.288864 0.245525 0.043073 0.041600 0.040406 0.041276 0.041316 0.040760 0.042444 0.173274 -0.528368 -0.284259 0.069583 0.091638 0.246746 0.042345
chargesum: -0.00000
polarizability: 8.18783979e+02 -4.16302967e+00 6.57551428e+02 4.16218616e-01 1.30947449e+00 6.49051853e+02
redmass: 10.7511 4.0948 9.5552 10.0864 7.4263 11.9049 4.6561 4.1352 3.7735 13.5910 5.4166 5.9301 7.9818 7.7479 10.0595 8.7377 8.2929 7.5621 8.2752 8.3821 7.4403 6.4628 7.0442 6.3753 6.0604 5.8746 10.1920 15.1461 14.9909 6.7993 6.5580 8.7752 12.4176 12.1729 7.2262 11.8208 9.2307 7.7100 8.4936 11.3878 11.9430 11.0427 9.8924 8.1164 10.6893 12.8619 12.1323 8.1840 9.8194 6.5850 6.2318 9.5703 9.6216 8.5667 8.9383 8.6432 13.0650 10.2242 10.6082 11.1130 10.1956 13.7078 12.6425 9.1924 5.0267 3.7293 4.5961 4.7840 3.6909 6.0206 4.2630 4.0019 8.6650 8.4749 3.7593 8.0537 7.4422 8.7400 8.5943 8.2897 9.1511 8.4075 8.9531 8.9370 9.5300 7.2694 8.7810 7.3535 9.5986 6.1562 7.2406 10.0623 2.3645 10.3123 7.7098 5.1838 5.9794 5.8083 7.5045 4.3402 5.2842 4.2706 5.1053 9.0960 8.6303 8.7254 2.9548 2.8925 3.0036 2.8968 8.6172 6.4559 6.6140 6.9553 7.1941 7.1045 7.5351 7.5453 6.8688 8.5234 8.8930 8.2208 2.3580 9.1896 5.0146 11.5081 6.2769 6.4779 6.2781 6.4911 1.7708 7.9756 8.8507 7.3864 8.1877 8.4455 7.7065 7.6218 8.9758 2.2504 3.3979 3.2716 3.6068 7.2425 5.0670 10.7526 7.0969 2.6758 6.0731 1.2557 1.2758 1.2763 1.2605 1.2551 2.0523 2.2161 2.4389 2.8917 2.6575 2.8534 11.3292 2.1149 2.3295 2.6085 1.8607 2.0552 1.7520 1.9662 5.0702 3.2275 3.2602 3.2792 1.4914 3.0053 2.4742 2.0662 1.7507 1.1714 3.1937 3.2288 3.1139 3.1690 1.2688 1.2515 1.2541 1.2505 6.9999 7.2901 6.6447 6.8169 1.4966 1.4874 1.4942 1.4845 1.7157 1.2883 1.2629 1.2503 1.2526 1.3287 1.3743 1.3645 1.3550 1.2431 2.3274 2.3341 2.3418 2.3569 1.6990 1.6997 1.7006 1.6994 1.7046 1.7044 1.7079 1.2076 1.2080 1.2060 1.2125 1.3378 1.3007 1.3015 1.3131 2.6229 2.6826 2.6926 2.6607 1.1035 1.1030 1.1036 1.1050 2.1237 1.4974 1.4918 1.4884 1.4863 1.3432 1.1219 1.1174 1.1183 1.1139 1.1101 1.1102 1.1114 1.4792 9.4076 9.6042 9.7238 9.4958 9.5806 9.4706 9.2026 3.4562 3.4221 3.3937 3.3592 3.3656 3.1584 3.3446 2.7243 4.0161 4.0523 4.6151 5.9483 6.6214 6.3362 6.3063 6.1913 3.8157 3.9510 2.3835 4.4958 9.0511 7.4862 6.3039 5.5373 6.1605 6.2808 6.2793 9.1184 8.8568 10.8821 10.9305 10.7747 10.7726 1.0858 1.0857 1.0858 1.0859 1.0860 1.0862 1.0867 1.0870 1.0079 1.0079 1.0079 1.0079 1.0620 1.0894 1.0891 1.0891 1.0890 1.0893 1.0893 1.0890 1.0893 1.0955 1.0954 1.0953 1.0947 1.0954 1.0957 1.0954 1.0953 1.1155 1.0665 1.0662 1.0665 1.0663 1.0663 1.0664
irintensity: 0.0183 0.0054 0.0099 0.0339 0.0581 0.0193 0.0045 0.0022 0.0348 0.4068 0.3111 0.2238 0.0160 0.0087 0.0401 0.1432 0.0757 0.9245 0.6701 0.1542 0.1537 0.9555 0.2495 1.7280 0.2910 0.6468 1.4378 0.3060 0.1120 4.5481 0.6941 1.0761 2.1122 0.5814 0.8760 0.7537 0.7289 2.1721 1.0551 0.4748 7.5685 8.7661 0.6267 2.8262 12.6376 3.2657 1.9981 2.6281 1.7770 8.4525 4.3309 0.9571 1.6233 4.7827 2.6115 5.2202 0.7484 6.7914 2.0337 0.3993 0.2057 1.7710 3.8422 4.7799 4.8751 1.1703 0.8091 0.4853 0.0522 12.8003 2.2759 1.8248 0.2197 0.1675 5.7512 1.9182 5.6691 0.7043 2.9410 2.5916 6.5670 11.5686 1.6873 13.7746 6.4585 0.8668 7.7423 3.0430 2.7111 19.9544 4.9144 30.4699 156.1944 272.0244 317.0098 7.6338 38.5293 38.8350 74.3157 8.0093 51.4721 2.3905 2.0848 32.4078 64.9827 78.0739 5.4231 1.5432 4.6372 0.6862 112.6820 13.8981 11.2029 5.0889 6.4700 103.6122 146.9795 169.6088 171.9686 284.9121 124.9475 273.4565 24.8967 13.2093 58.8766 37.9696 12.4876 2.1721 13.0813 0.1238 104.7745 184.6169 75.4483 0.9362 52.3230 0.3962 1.8985 19.5811 22.6085 15.3684 10.9646 1.5229 14.7249 228.0498 18.3877 280.3441 291.2817 115.8321 392.7076 17.8485 111.9710 72.6806 102.2996 92.9630 77.2604 44.0667 139.1739 35.5079 131.6069 110.6636 21.2125 8.6673 24.8443 38.8333 205.7851 9.2864 1.9771 29.8653 6.6025 16.0880 1.7707 7.4944 27.2578 0.9696 3.5829 19.7471 7.3379 87.2942 1.1047 1.4146 1.0361 1.5060 0.3375 0.6056 0.3359 0.0049 0.2417 0.3583 0.2330 0.5151 2.2909 0.9101 3.4415 2.6009 22.9753 0.0686 0.1084 0.0547 0.1018 0.0517 0.0846 0.0590 0.0120 9.5071 14.6055 13.8231 14.9189 15.8334 0.1128 0.4134 0.8376 0.9771 0.2855 0.7236 0.0887 3.6221 4.2425 3.5392 4.5562 7.8935 7.7028 8.7594 9.5804 14.0916 18.7015 37.7348 19.3211 2.3084 2.4092 2.4597 2.5510 85.2857 0.2787 0.0668 0.0393 0.2013 123.9228 1.7608 14.6809 10.1045 3.8878 28.9902 35.5249 30.8457 106.1041 1.5970 1.2531 6.4438 126.9401 306.2263 417.8534 775.4025 197.2768 741.2549 23.3977 105.1294 20.2651 1123.3922 301.1347 279.1629 198.8512 414.8080 927.8326 454.9629 20.7635 36.6858 38.3551 31.4443 34.7087 32.0732 109.0880 19.4330 88.1565 95.1172 23.4932 164.7660 25.3731 47.7576 53.0875 29.4448 634.3196 398.4583 1571.9950 1141.0343 783.1618 96.8800 24.1538 108.2986 125.6239 148.4906 264.1291 200.3496 82.3215 14.8574 13.4817 14.1074 12.8870 2.0556 13.9978 10.0017 9.9552 10.3787 9.9879 11.4236 8.8906 9.8191 7.3728 6.8329 8.6689 5.3673 3.5004 3.9680 7.2089 4.3273 4.1922 786.2140 64.1955 13.9934 67.4440 62.9273 128.7069
temp: 298.150 k
press: 1.00000 atm
elementType: 40 40 40 40 40 40 8 8 8 8 8 8 8 8 8 8 8 8 8 8 8 8 8 8 8 8 8 8 8 8 8 8 8 8 8 8 6 6 6 6 6 6 6 6 6 6 6 6 6 6 6 6 6 6 6 6 6 6 6 6 6 6 6 6 6 6 6 6 6 6 6 1 1 1 1 1 1 1 1 1 1 1 1 1 1 1 1 1 1 1 1 1 1 1 1 8 1 1 1 1 1 1 1 1 6 8 6 1 1 1 1
symmnumber: 1
zpe: 1920605.7 jmol-1
zpe.correction: 0.731520 hartree
zpe.thermalcorrener: 0.806231 hartree
zpe.thermalcorrenthalpy: 0.807175 hartree
zpe.thermalcorrgfe: 0.627711 hartree
zpe.sumelectzpe: -4119.664963 hartree
zpe.sumelectthermal: -4119.590252 hartree
zpe.sumelectthermalent: -4119.589308 hartree
zpe.sumelectthermalfe: -4119.768772 hartree
dipole: -0.2341 -1.0626 -4.5079
dipole: 4.6373
quadrupole: -465.6478 -494.9684 -492.6007
quadrupole: -0.6595 4.3691 4.6761
quadrupole: 18.7578 -10.5628 -8.1950 -0.6595 4.3691 4.6761
hfenergy: -4120.3964829 hartree
pointgroup: C01 [X(C37H36O32Zr6)]
dipole: -0.0920838 -0.4180786 -1.773532 debye
polarizability: 818.7839797|-4.1630201|657.5514273|0.4162185|1.3094745|649.0518525 unknown
InChI: InChI=1/37C.32O.6Zr.36H
charge 0 multiplicity 1
111 atoms
Zr 2.429215 -0.113752 1.003272
Zr -2.585637 -0.056342 0.663891
Zr 0.068993 1.874992 -0.795608
Zr -0.205832 1.523892 2.765437
Zr 0.033717 -1.737148 -1.038633
Zr -0.21113 -2.019308 2.480573
O  1.331771 1.879906 1.125074
O  3.601939 1.33074 -0.206919
O  1.718408 2.121529 3.756041
O  2.105788 2.639547 -1.246042
O  1.073169 0.016305 -0.582637
O  3.384559 1.090399 2.641044
O  0.855307 -0.238302 2.383046
O  1.32483 -2.114313 0.781723
O  3.375804 -1.597896 2.407856
O  3.578848 -1.374682 -0.440308
O  1.706381 -2.798299 3.333557
O  2.051579 -2.334055 -1.775771
O  -0.292546 0.68908 4.852225
O  -1.910549 2.733608 -1.415261
O  -3.5598 1.437019 -0.626804
O  -1.63693 -0.257909 2.749439
O  -0.039552 3.939955 0.088845
O  -1.115913 1.366711 0.902905
O  -1.29663 0.097287 -1.308456
O  -2.226429 2.264926 3.399031
O  -0.211414 3.710953 2.323738
O  -3.741928 1.254513 2.071099
O  -1.893842 -2.419285 -1.97481
O  -0.298529 -1.556733 4.664227
O  -2.239713 -2.845842 2.953313
O  -3.744213 -1.60766 1.817467
O  -1.12841 -1.561168 0.652396
O  -3.531052 -1.361044 -0.863217
O  -0.08313 -3.925508 -0.592084
O  -0.234668 -4.105298 1.648698
C  5.722525 2.77237 -1.3385
C  4.383079 3.040819 -1.644661
C  5.081158 4.785132 -3.168372
C  3.287911 2.277943 -0.991208
C  6.734909 3.513865 -1.940729
C  2.917896 1.809396 3.558713
C  4.067542 4.048103 -2.566455
C  6.41417 4.520956 -2.852412
C  5.02051 -4.179888 -4.035426
C  5.671911 -2.568568 -1.849666
C  4.329728 -2.747851 -2.209657
C  6.679425 -3.197234 -2.575785
C  3.246302 -2.101482 -1.419766
C  6.355765 -4.006025 -3.667067
C  4.010418 -3.554527 -3.310486
C  2.907922 -2.460114 3.190008
C  -4.125433 3.288206 -1.982008
C  -3.125265 2.433066 -1.285543
C  -3.692599 4.368574 -2.762368
C  -5.981352 4.874528 -3.336289
C  -6.418376 3.802736 -2.555812
C  -5.494494 3.01066 -1.880096
C  -4.618564 5.15803 -3.436938
C  -0.282032 -0.478418 5.309871
C  -0.176533 4.374104 1.256514
C  -3.38775 2.054752 2.971781
C  -5.489341 -2.539472 -2.429601
C  -3.113606 -2.167921 -1.739738
C  -3.738661 -3.786344 -3.548913
C  -3.398186 -2.55589 2.562559
C  -4.131797 -2.849082 -2.584723
C  -4.693289 -4.400813 -4.353395
C  -6.441112 -3.15356 -3.237091
C  -0.21357 -4.565103 0.482069
C  -6.043267 -4.081718 -4.200087
H  3.017573 4.235801 -2.797718
H  4.834018 5.570102 -3.886544
H  1.896672 2.654468 1.218621
H  7.780106 3.30869 -1.69865
H  5.950475 1.982004 -0.620691
H  4.767011 -4.809383 -4.891329
H  7.724394 -3.05828 -2.289778
H  5.90555 -1.934427 -0.992369
H  2.960467 -3.684058 -3.580185
H  1.888758 -2.894432 0.750072
H  -2.621746 4.569077 -2.829543
H  -7.485749 3.584661 -2.475798
H  -5.815797 2.167013 -1.266284
H  -4.278304 5.99829 -4.046315
H  -1.818649 0.239685 -2.105338
H  -2.248494 -0.321151 3.490594
H  -5.777578 -1.809918 -1.670748
H  -2.677798 -4.02353 -3.650881
H  -4.386177 -5.132425 -5.104012
H  -7.498764 -2.908598 -3.117624
H  7.148004 -4.50025 -4.23445
H  7.211228 5.102275 -3.322664
H  -6.791625 -4.563054 -4.834433
H  -6.708297 5.493801 -3.867533
O  0.165681 -1.410183 -3.322665
H  -0.644986 -1.144909 -3.772839
H  -0.311138 -5.66807 0.386067
H  -0.266465 5.476773 1.36495
H  -4.215389 -3.213579 2.931131
H  -4.200834 2.638322 3.455571
H  3.645004 -2.998578 3.824595
H  3.657081 2.228002 4.275925
H  -0.267171 -0.573026 6.417281
C  1.076735 1.53605 -3.829226
O  0.198031 1.787713 -2.898067
C  2.175751 0.742655 -3.734086
H  2.84225 0.62945 -4.590482
H  2.490905 0.323072 -2.773276
H  0.870043 -0.776244 -3.624774
H  0.847068 1.995289 -4.809741
