program: Gaussian 16
title: Title Card Required
version: ES64L-G16RevC.01
frameworkgroup: C1[X(C37H36O32Zr6)]
method: RM06L
basis: Gen
operation: Freq
keyword: #pfreq=noraman
keyword: gen
keyword: integral=grid=ultrafine
keyword: m06l
keyword: pseudo=read
keyword: scf=(intrep,xqc,maxconventionalcycles=150)
title: #p freq=noraman gen integral=grid=ultrafine m06l pseudo=read scf=(intr
basis: NPDir=0 NMtPBC= 1 NCelOv= 1 NCel= 1 NClECP= 1 NCelD= 1
basis: NCelK= 1 NCelE2= 1 NClLst= 1 CellRange= 0.0.
basis: One-electron integrals computed using PRISM.
basis: One-electron integral symmetry used in STVInt
converged: YES YES NO YES
title: Mulliken charges:
elementType: Zr Zr Zr Zr Zr Zr O O O O O O O O O O O O O O O O O O O O O O O O O O O O O O C C C C C C C C C C C C C C C C C C C C C C C C C C C C C C C C C C C H H H H H H H H H H H H H H H H H H H H H H H H O H H H H H H H H C O C H H H H
charge: 1.605754 1.614063 1.558870 1.657859 1.483284 1.647089 -0.622148 -0.474244 -0.452808 -0.483825 -0.858880 -0.453966 -0.858515 -0.622397 -0.454799 -0.484107 -0.451238 -0.479379 -0.455715 -0.486421 -0.483861 -0.619104 -0.453546 -0.860456 -0.622891 -0.455261 -0.453716 -0.451759 -0.461279 -0.449876 -0.454749 -0.451985 -0.859678 -0.499932 -0.451379 -0.454943 -0.016329 -0.110035 -0.030615 0.526718 -0.031765 0.456134 -0.033699 -0.022224 -0.028819 -0.018010 -0.107768 -0.032664 0.537710 -0.023292 -0.030799 0.455794 -0.113258 0.569539 -0.021071 -0.023369 -0.031962 -0.019536 -0.033494 0.454698 0.458020 0.457313 -0.021691 0.562082 -0.019357 0.456829 -0.112267 -0.032222 -0.033500 0.453601 -0.024534 0.063818 0.044222 0.249814 0.044324 0.063590 0.043020 0.043718 0.061771 0.054194 0.247341 0.062490 0.041823 0.063782 0.040922 0.283766 0.245868 0.060451 0.063587 0.039264 0.040337 0.046910 0.047792 0.043123 0.044704 -0.521786 0.216216 0.039986 0.040838 0.040086 0.040014 0.039322 0.040044 0.041241 0.337834 -0.409694 -0.131234 0.104567 0.067000 0.092592 0.062122
chargesum: -0.00000
polarizability: 8.11700871e+02 -1.11098736e+00 6.62542475e+02 3.42104516e+00 4.47566774e-01 6.41400391e+02
redmass: 10.7613 9.0730 9.3504 10.2729 12.2373 5.1939 3.7447 3.8290 5.4983 6.5365 5.5586 7.9282 7.0990 10.1471 9.1748 9.6115 7.0929 7.9269 7.6564 8.3412 7.4325 6.7364 6.5631 5.7234 6.3968 7.0301 8.3447 18.6507 12.3683 8.1530 5.4915 7.8555 11.1858 11.4526 8.9395 9.5157 9.3200 10.4650 11.6531 9.5130 9.8116 12.7661 11.2325 10.8697 15.9064 10.6520 13.3095 8.7418 10.4413 11.4364 8.1278 9.4771 9.4821 9.0017 8.0340 9.9051 11.4826 9.3409 11.4214 11.6444 14.8818 11.7434 15.4547 3.7049 4.1550 4.1664 4.6848 9.5278 3.6526 4.5309 4.1488 3.6630 4.2837 6.9749 3.8531 3.4980 3.2596 7.6025 8.7835 6.2855 9.0765 8.5753 8.5101 8.4249 9.3274 6.7056 8.7070 7.7075 9.0363 9.8646 10.2554 9.6592 9.8280 10.2858 10.7673 6.9403 4.3734 4.7999 4.4816 4.4628 4.2532 10.4959 5.3849 7.1292 10.1712 9.4851 2.8922 2.8894 2.8887 2.9678 5.8601 6.2377 6.6955 5.3359 5.3902 6.7072 7.4349 2.4506 5.2031 8.6835 7.6773 7.5416 8.1654 2.6164 11.8392 12.2958 11.2552 7.1545 6.7874 6.9740 6.6226 7.9682 9.3513 8.1153 8.1697 8.9105 8.1962 8.6646 8.7098 3.3889 3.3833 3.3420 3.4506 9.4060 11.0349 13.0970 10.0706 12.3804 1.3015 1.2891 1.3094 1.2846 1.1940 1.5630 1.9255 2.1423 2.0430 2.6006 1.8740 1.1670 11.3491 4.3424 3.3093 1.7841 1.1645 2.2304 2.0808 2.1241 3.0064 3.2530 4.5842 4.1872 2.2218 3.0456 2.7079 2.5986 1.8389 3.2318 3.2125 3.2232 3.2121 1.2487 1.2473 1.2497 1.2482 6.9715 7.1573 6.8573 7.0104 1.4938 1.4867 1.4890 1.4799 1.7861 1.2547 1.2738 1.2745 1.2773 1.3440 1.3628 1.3487 1.3259 2.3199 2.3258 2.3300 2.3296 1.6999 1.7006 1.7031 1.7022 1.7063 1.7075 1.7096 1.6382 1.2027 1.2054 1.2061 1.2066 1.9899 1.2948 1.3449 1.2971 1.3417 2.5198 2.6499 2.7118 2.7199 1.1027 1.1043 1.1042 1.1056 1.4963 1.4943 1.4924 1.4923 1.2604 1.1209 1.1137 1.1162 1.1153 1.1100 1.1095 1.1086 1.0551 9.5236 9.5577 9.6352 1.2193 9.6730 9.7350 9.6233 9.2329 1.1201 3.4633 3.4078 3.3471 3.3697 3.3842 3.2793 3.3962 2.7582 3.7636 4.0965 4.5127 5.9284 6.5322 6.4291 6.2381 6.2369 9.8580 10.2762 10.4109 11.0563 10.2206 6.2684 6.3422 6.3148 6.3319 10.4286 10.4621 11.2049 10.9989 10.5722 10.4142 9.4091 1.0856 1.0857 1.0856 1.0858 1.0859 1.0860 1.0866 1.0878 1.0441 1.0079 1.0079 1.0079 1.0079 1.0951 1.0894 1.0890 1.0894 1.0894 1.0889 1.0893 1.0888 1.0892 1.1060 1.0957 1.0955 1.0955 1.0948 1.0948 1.0954 1.0951 1.0949 1.0661 1.0662 1.0663 1.0663 1.0663
irintensity: 0.0001 0.0428 0.0169 0.0544 0.0292 0.0093 0.0257 0.0113 0.3550 0.1790 0.4081 0.0522 0.1149 0.7175 0.0599 0.3533 0.4636 1.9402 0.7409 0.1561 0.4582 1.5172 2.1593 2.1259 0.7460 1.3762 1.2493 0.1825 0.5647 1.8591 0.3528 1.1528 2.4911 0.9034 3.8051 2.0522 0.9733 2.9919 2.7274 3.7925 7.6742 1.1808 2.2736 7.1835 2.8314 13.5159 2.4833 2.1857 5.0812 9.9242 4.6002 1.9555 1.9809 0.3323 11.9116 1.3807 3.1890 5.7467 0.7554 0.6372 1.4415 4.0787 4.9862 11.1566 0.5573 0.7749 5.3631 7.0637 0.3491 2.7406 2.0725 6.9674 1.1247 2.0188 5.1420 1.5354 3.5089 0.9486 2.3018 3.7483 3.3735 0.9813 17.8844 7.6619 11.5438 0.3928 7.2338 3.9189 11.0916 6.6147 6.4313 3.8893 87.2847 278.9904 269.6424 75.0292 81.9624 22.9657 6.9100 4.7250 9.1627 49.5908 4.6183 51.2894 79.2159 104.5884 0.2509 0.3932 0.1554 1.6966 2.6257 8.5049 8.6319 24.2659 39.1081 125.4958 100.7212 151.0694 43.9983 408.1567 128.3118 381.6922 177.3126 22.8111 1.6282 35.7173 43.2825 3.1387 2.3725 2.9016 0.6590 184.7384 61.2612 8.5590 28.6588 30.6738 5.7507 14.2406 6.1769 3.3622 17.1643 6.2762 3.5583 217.3678 202.5305 160.9582 336.0455 209.5362 66.3124 39.1134 154.5476 182.5760 103.0474 87.5216 78.6366 159.4049 63.0598 98.6669 140.5823 94.6897 21.6789 22.4401 44.6571 107.4298 16.0988 1.3380 5.2140 23.1079 17.2851 0.4494 6.3291 4.7458 16.3657 0.7059 2.1184 5.0190 21.9812 1.0047 1.2863 1.2600 1.0782 0.0615 0.0224 0.0515 0.0888 0.2389 0.4340 0.0015 0.4479 2.9885 1.9373 1.6035 2.5257 9.4113 0.1055 0.0573 0.0591 0.0722 0.0140 0.0119 0.0210 0.2105 10.8404 12.3304 22.1593 15.5184 0.1519 0.2551 0.9294 1.1795 0.3638 0.5551 0.1555 44.9973 3.3412 4.6915 2.2636 5.6439 36.0162 6.2394 5.2015 13.4297 7.4252 14.9083 23.4132 25.6439 27.3645 2.2904 1.8307 3.0635 2.5469 0.1453 0.0343 0.0829 0.0467 5.4773 1.3776 12.9555 9.7008 7.8453 27.5992 27.0477 42.6275 18.2389 7.7553 1.8579 3.8400 13.3594 150.4576 225.6330 461.5810 788.0839 28.2891 305.5438 714.5764 228.4758 70.1844 322.3701 835.3603 14.8548 271.0826 192.7080 323.9838 875.3099 496.5181 17.2044 30.6986 38.4156 28.1349 51.6535 5.6575 11.5157 101.5842 34.8451 32.4785 26.9989 47.1281 31.1988 10.0079 328.4373 486.9012 1523.6552 1370.6877 924.6734 124.4087 48.8388 103.7743 18.2099 176.4756 196.3771 165.2160 278.4095 44.3277 12.8814 14.8811 15.3316 12.8116 12.4877 5.8399 12.2502 3.9371 12.4530 11.2261 13.3587 11.2354 7.7065 14.2816 1.9873 7.5400 1.6351 5.6080 2.7467 7.5446 7.3933 6.2439 8.4928 74.3153 50.2931 67.7728 68.2690 53.9297
temp: 298.150 k
press: 1.00000 atm
elementType: 40 40 40 40 40 40 8 8 8 8 8 8 8 8 8 8 8 8 8 8 8 8 8 8 8 8 8 8 8 8 8 8 8 8 8 8 6 6 6 6 6 6 6 6 6 6 6 6 6 6 6 6 6 6 6 6 6 6 6 6 6 6 6 6 6 6 6 6 6 6 6 1 1 1 1 1 1 1 1 1 1 1 1 1 1 1 1 1 1 1 1 1 1 1 1 8 1 1 1 1 1 1 1 1 6 8 6 1 1 1 1
symmnumber: 1
zpe: 1921570.5 jmol-1
zpe.correction: 0.731888 hartree
zpe.thermalcorrener: 0.806276 hartree
zpe.thermalcorrenthalpy: 0.807220 hartree
zpe.thermalcorrgfe: 0.629232 hartree
zpe.sumelectzpe: -4119.674318 hartree
zpe.sumelectthermal: -4119.599930 hartree
zpe.sumelectthermalent: -4119.598986 hartree
zpe.sumelectthermalfe: -4119.776974 hartree
dipole: 2.8112 0.5512 -5.5969
dipole: 6.2874
quadrupole: -464.2610 -493.1375 -490.5648
quadrupole: -1.3877 -9.2197 -0.3643
quadrupole: 18.3934 -10.4831 -7.9103 -1.3877 -9.2197 -0.3643
hfenergy: -4120.4062059 hartree
pointgroup: C01 [X(C37H36O32Zr6)]
dipole: 1.1060285 0.2168496 -2.201973 debye
polarizability: 811.7008713|-1.1109822|662.5424751|3.4210451|0.4475669|641.4003913 unknown
InChI: InChI=1/37C.32O.6Zr.36H
charge 0 multiplicity 1
111 atoms
Zr 2.417805 -0.023443 1.006176
Zr -2.602932 -0.005489 0.65839
Zr 0.039697 1.80675 -0.873745
Zr -0.207102 1.741165 2.663339
Zr 0.027099 -1.798075 -0.978335
Zr -0.224634 -1.810966 2.590603
O  1.331041 1.992529 0.983449
O  3.56557 1.369153 -0.330836
O  1.72536 2.41277 3.589797
O  2.05997 2.53953 -1.519038
O  1.070605 0.012223 -0.581239
O  3.387661 1.310347 2.537106
O  0.855069 -0.030296 2.391435
O  1.322275 -2.014517 0.916626
O  3.374186 -1.392727 2.510505
O  3.593643 -1.356888 -0.353826
O  1.701467 -2.52945 3.507806
O  2.092817 -2.494679 -1.577924
O  -0.288959 1.063547 4.792711
O  -1.853843 2.621889 -1.695109
O  -3.513936 1.466379 -0.726068
O  -1.642343 -0.024302 2.761967
O  -0.051913 3.950518 -0.190619
O  -1.117385 1.466748 0.801941
O  -1.315433 0.01072 -1.305402
O  -2.229263 2.532343 3.221459
O  -0.211268 3.896723 2.056301
O  -3.742558 1.425049 1.968278
O  -1.969017 -2.626536 -1.598539
O  -0.292173 -1.189939 4.751824
O  -2.24221 -2.59913 3.159655
O  -3.753841 -1.448974 1.944175
O  -1.138091 -1.456552 0.768397
O  -3.60658 -1.349756 -0.75605
O  -0.029235 -3.951317 -0.324938
O  -0.24497 -3.945331 1.918589
C  5.68739 2.640181 -1.601375
C  4.352552 2.949357 -1.89445
C  5.098874 4.607539 -3.493277
C  3.247351 2.234828 -1.195777
C  6.719257 3.312464 -2.249981
C  2.924267 2.088461 3.406893
C  4.064718 3.936858 -2.846587
C  6.427076 4.297509 -3.195089
C  5.067189 -4.56363 -3.586486
C  5.711932 -2.617869 -1.685459
C  4.370637 -2.911248 -1.959292
C  6.723555 -3.29515 -2.360437
C  3.274775 -2.201331 -1.242892
C  6.401573 -4.2677 -3.308697
C  4.055036 -3.887135 -2.91471
C  2.901932 -2.20178 3.347409
C  -4.080073 3.132001 -2.290093
C  -3.077466 2.354987 -1.511629
C  -3.665134 4.125469 -3.186062
C  -5.966825 4.563454 -3.768128
C  -6.385694 3.576926 -2.874388
C  -5.446471 2.862903 -2.136972
C  -4.606975 4.838137 -3.922158
C  -0.274392 -0.074727 5.325206
C  -0.183565 4.474826 0.942053
C  -3.389953 2.289715 2.806311
C  -5.531171 -2.732946 -2.244742
C  -3.174822 -2.293468 -1.490944
C  -3.726288 -4.059556 -3.166806
C  -3.403302 -2.337562 2.757928
C  -4.167784 -3.044773 -2.307484
C  -4.637139 -4.751509 -3.957858
C  -6.440803 -3.426989 -3.037761
C  -0.188991 -4.498749 0.79228
C  -5.99414 -4.433605 -3.895566
H  3.019964 4.169928 -3.062557
H  4.870337 5.378982 -4.232049
H  1.89369 2.772771 1.02798
H  7.758455 3.069766 -2.017176
H  5.895822 1.8693 -0.857128
H  4.817886 -5.327017 -4.326795
H  7.770079 -3.06715 -2.146292
H  5.940902 -1.856596 -0.9371
H  3.004696 -4.110481 -3.110677
H  1.87858 -2.799794 0.948037
H  -2.59699 4.323421 -3.292594
H  -7.450308 3.364317 -2.753985
H  -5.752481 2.086053 -1.434065
H  -4.281536 5.612034 -4.621009
H  -1.755651 0.018475 -2.164662
H  -2.249231 -0.031271 3.509522
H  -5.858687 -1.939633 -1.570006
H  -2.659107 -4.285305 -3.201629
H  -4.290218 -5.540769 -4.628678
H  -7.504379 -3.1824 -2.99004
H  7.198647 -4.799087 -3.834446
H  7.238103 4.825919 -3.701862
H  -6.710482 -4.974994 -4.51856
H  -6.704937 5.123203 -4.347801
O  0.108284 -1.506959 -3.052333
H  0.746651 -2.093122 -3.475538
H  -0.278637 -5.606958 0.788537
H  -0.275034 5.582521 0.96311
H  -4.218983 -2.961565 3.183763
H  -4.203237 2.909404 3.243055
H  3.638221 -2.694887 4.019168
H  3.666444 2.555877 4.090304
H  -0.253785 -0.093333 6.436543
C  0.820629 0.543668 -3.802464
O  0.160848 1.31344 -3.09831
C  2.256086 0.233254 -3.586718
H  2.475302 0.087566 -2.521925
H  2.578129 -0.639487 -4.166857
H  2.841643 1.101243 -3.934124
H  0.383503 0.246052 -4.776676
