program: Gaussian 16
title: Title Card Required
version: ES64L-G16RevC.01
frameworkgroup: C1[X(H2O)]
method: RM06L
basis: Gen
operation: Freq
keyword: #p
keyword: freq=noraman
keyword: gen
keyword: integral=grid=ultrafine
keyword: m06l
keyword: scf=(intrep,xqc,maxconventionalcycles=150)
title: #p freq=noraman gen integral=grid=ultrafine m06l scf=(intrep,xqc,maxco
basis: NPDir=0 NMtPBC= 1 NCelOv= 1 NCel= 1 NClECP= 1 NCelD= 1
basis: NCelK= 1 NCelE2= 1 NClLst= 1 CellRange= 0.0.
basis: One-electron integrals computed using PRISM.
basis: One-electron integral symmetry used in STVInt
basis: NBasis= 24 RedAO= T EigKep= 3.75D-02 NBF= 24
basis: NBsUse= 24 1.00D-06 EigRej= -1.00D+00 NBFU= 24
converged: YES YES YES YES
title: Mulliken charges:
elementType: O H H
charge: -0.330358 0.165179 0.165179
chargesum: -0.00000
title: Mulliken charges with hydrogens summed into heavy atoms:
elementType: O
charge: -0.000000
chargesum: 0.00000
polarizability: 6.93493312e+00 5.45115818e-10 5.33858213e+00 7.91468039e-05 -2.05266275e-05 3.09693716e+00
1716.lowfreq: -89.5189 -70.0278 -67.1680 0.0018 0.0026 0.0027 1683.5958 3859.6505 3971.7326
frequency: 1683.5958 3859.6505 3971.7325
redmass: 1.0805 1.0472 1.0800
irintensity: 59.3114 10.7838 46.8690
temp: 298.150 k
press: 1.00000 atm
elementType: 8 1 1
symmnumber: 1
zpe: 56912.2 jmol-1
zpe.correction: 0.021677 hartree
zpe.thermalcorrener: 0.024512 hartree
zpe.thermalcorrenthalpy: 0.025456 hartree
zpe.thermalcorrgfe: 0.003370 hartree
zpe.sumelectzpe: -76.328345 hartree
zpe.sumelectthermal: -76.325510 hartree
zpe.sumelectthermalent: -76.324566 hartree
zpe.sumelectthermalfe: -76.346651 hartree
dipole: 0.0000 -2.0155 0.0000
dipole: 2.0155
quadrupole: -4.2951 -5.8918 -7.0025
quadrupole: 0.0000 0.0001 -0.0000
quadrupole: 1.4347 -0.1620 -1.2727 0.0000 0.0001 -0.0000
hfenergy: -76.3500218 hartree
pointgroup: C01 [X(H2O1)]
dipole: 0. -0.792959 0.0000073 debye
dipolederiv: -0.4874934 0. 0.0000043 0. -0.3485414 -0.0000032 0.0000045 -0.0000032 -0.6981379 0.2437467 0.0451049 -0.0000026 0.084417 0.1742707 0.0000033 -0.000003 0.0000025 0.349069 0.2437467 -0.0451049 -0.0000017 -0.084417 0.1742707 -0.0000002 -0.0000015 0.0000007 0.349069 unknown
polarizability: 6.9349331|0.|5.3385821|0.0000791|-0.0000205|3.0969372 unknown
InChI: InChI=1/O.2H
charge 0 multiplicity 1
3 atoms
O  0.0000 0.120271 -0.000001
H  0.751244 -0.481086 0.00002
H  -0.751244 -0.481086 -0.000011
