program: Gaussian 16
title: Title Card Required
version: ES64L-G16RevC.02
method: UwB97XD
basis: 6-31+G(d,p)
operation: Freq
keyword: #P
keyword: Geom=AllCheck
keyword: Guess=TCheck
keyword: SCRF=Check
keyword: GenChk
keyword: UwB97XD/6-31+G(d,p)
keyword: Freq
converged: YES YES YES YES
polarizability: 4.74218644e+02 6.11524706e+01 4.98917686e+02 4.05361184e+01 -9.44915607e+00 4.39476520e+02
1716.lowfreq: -413.1636 -0.0006 -0.0004 0.0009 2.6594 6.0514 10.6709 16.3300 21.7766
frequency: -413.1633 15.8341 21.7686 32.1958 38.2127 55.0780 56.3049 60.7301 67.7206 84.7826 91.7262 100.3247 107.9907 117.9725 128.2402 156.2392 166.8175 185.9102 193.2432 208.1697 226.1028 256.4058 268.2384 275.0057 279.7169 307.7832 319.5430 333.3610 355.8521 404.8586 418.1091 418.8679 421.7612 430.4856 440.6798 457.1992 462.1641 484.2619 519.5247 533.8043 540.1630 555.8256 561.2235 574.1013 582.8408 593.4899 596.6005 612.6242 628.7552 635.7510 637.4290 657.9887 668.6735 702.2004 709.8488 727.1592 731.0787 734.4182 756.0985 769.4220 773.4834 780.1762 784.9183 797.3883 814.6915 843.2076 857.8928 874.3381 876.4559 883.3460 886.7408 887.9055 895.4677 898.3418 929.1043 944.0023 954.9629 960.6688 965.3700 974.6881 985.5723 985.8521 986.6093 1014.7557 1017.2160 1019.7895 1024.0625 1026.2889 1027.3468 1034.1054 1035.3483 1040.2865 1041.3812 1046.4977 1056.4707 1063.5382 1067.8418 1077.1060 1078.6270 1088.1239 1100.2815 1112.0408 1112.5915 1122.0794 1125.4100 1135.6701 1143.0881 1167.1541 1178.9019 1191.0368 1196.1956 1196.6370 1203.7325 1210.9977 1215.4115 1221.9665 1224.3363 1227.5997 1228.9746 1229.8340 1233.0665 1260.2292 1267.3717 1276.9558 1280.9861 1292.6978 1316.0962 1320.6407 1328.4690 1338.8754 1344.3354 1346.3347 1351.2288 1355.0098 1356.8409 1364.5895 1369.7249 1373.8558 1377.0282 1380.0642 1385.3634 1388.9572 1395.7509 1398.5795 1404.2032 1409.6555 1417.7202 1427.5298 1434.1908 1466.7899 1474.6943 1482.6242 1497.8938 1502.6770 1505.6595 1507.3154 1509.6359 1510.8164 1515.0997 1524.2929 1528.6994 1532.0474 1550.1825 1553.0886 1659.1559 1665.8800 1666.9957 1679.2668 1685.3237 1685.9958 1687.5411 1793.9176 3081.4314 3091.7056 3102.0265 3109.2162 3110.8688 3119.0015 3125.7171 3127.4332 3129.6842 3130.5393 3140.2635 3158.5904 3173.7033 3178.3850 3179.2497 3204.6760 3206.6622 3208.0645 3211.5977 3214.8802 3217.0242 3220.6304 3220.9396 3227.3417 3228.5942 3229.2763 3234.4517 3236.0282 3236.2522 3245.5706 3246.0624 3250.4755 3279.3814 3475.3326 3644.1956
redmass: 5.3343 5.2434 5.0781 5.4407 5.2487 3.3851 4.3958 4.2161 3.6067 3.5899 2.8305 4.2798 4.6266 4.0656 4.6445 4.4201 4.0495 3.8904 2.7425 4.6003 5.2911 3.8898 4.3274 1.9527 4.0356 3.8922 4.2689 4.1326 3.4397 3.5700 3.8217 3.3644 4.4682 2.9656 3.0752 3.9999 3.3082 3.7116 3.7786 3.9937 3.3653 2.5993 2.8850 2.5262 2.5562 3.6084 3.3080 3.4089 3.5817 5.8986 5.2613 3.6848 3.3680 3.4393 3.9563 1.5433 2.9379 1.6256 3.0772 3.7444 4.0931 1.2984 2.0318 3.1321 2.9263 1.6601 2.4748 2.7239 1.2597 1.9839 1.3521 2.6848 2.7773 1.3815 1.8246 2.1134 1.9369 1.4070 1.8275 1.5042 1.7294 2.1475 1.4713 1.3911 1.9004 1.6087 5.2358 3.8005 3.0202 1.9686 1.6147 1.3260 1.3383 3.0660 2.2200 2.8046 2.2403 1.9412 1.8928 1.7365 1.8334 1.9717 1.8950 1.7427 1.6104 1.6785 1.9701 2.4085 1.4516 1.2767 1.1165 1.1154 2.2847 1.7398 1.5152 2.1262 1.1292 1.3519 1.3636 1.5052 1.8055 2.0731 1.8816 1.4596 1.4104 1.3140 1.6723 1.5177 1.6951 2.1325 1.5155 2.0559 1.9423 1.8683 1.5443 1.4211 1.8317 1.8000 1.5128 1.3712 2.3046 1.4367 1.4933 1.2662 1.3976 1.3791 1.2739 1.6122 3.2297 1.2657 1.1582 1.0877 2.0461 1.1096 1.2892 2.1508 1.5857 1.0848 1.1103 1.9931 1.1223 2.6834 2.2310 2.2408 6.6363 5.6628 5.6350 6.6537 5.4974 5.2051 5.2437 11.6700 1.0695 1.0648 1.0677 1.0644 1.0853 1.0868 1.0878 1.0686 1.0639 1.0776 1.0606 1.1012 1.1017 1.0984 1.1047 1.1099 1.0923 1.0905 1.1086 1.0928 1.1038 1.0877 1.0922 1.0904 1.0909 1.0885 1.0921 1.0950 1.0952 1.0995 1.0994 1.0973 1.0954 1.0775 1.0761
irintensity: 1007.5812 0.0663 0.6824 0.5188 2.6748 0.2257 0.8824 3.3939 1.1336 3.4253 1.5240 1.3527 1.6117 0.9931 1.4729 14.0823 8.0420 2.9549 5.3903 1.9897 6.3240 2.8111 2.5794 2.1540 6.8369 4.3430 16.6565 19.0414 1.3056 11.8268 6.5413 4.9555 4.8122 0.4564 4.5394 8.2298 16.7116 42.2135 4.6808 2.8355 21.3080 15.5303 52.2822 13.4633 7.1536 34.3661 11.9185 9.6103 118.9273 19.4080 37.0640 13.6624 15.5811 13.4963 5.1429 95.5365 12.2493 141.5452 26.0245 1.6382 14.8807 81.5854 0.8719 12.5395 9.8202 0.9940 17.2368 14.6962 0.8818 13.2208 0.8074 3.3448 5.4451 16.5731 54.1111 14.0937 2.2219 3.6452 28.3690 11.4029 12.6021 18.4220 11.7776 0.1804 38.6315 0.1173 3.9282 7.8051 6.4630 18.8160 10.2944 0.8244 1.1060 35.6118 2.2854 9.2639 6.4827 2.1501 5.2377 12.9277 6.9160 5.0166 5.0482 18.6432 10.0118 22.5851 1.9912 34.0473 54.7497 17.9002 0.0720 0.2686 57.6445 46.1323 4.4877 18.3588 1.1165 2.3653 4.8824 12.4407 3.6674 30.9117 24.6520 4.2635 2.9019 23.3061 20.4829 52.7509 217.5563 12.8595 26.9684 18.2073 48.2958 23.2597 10.1965 6.4944 22.4682 32.0918 4.8602 5.8088 44.2097 41.2828 62.7119 4.9416 2.8166 73.1839 52.9816 115.4076 521.6200 85.3639 30.1456 22.6649 74.8192 19.5184 30.4388 60.7331 12.3514 16.2812 6.8945 354.9862 21.9194 69.3947 5.8814 7.1756 8.5591 10.4404 2.7148 204.0115 76.5487 133.7941 103.1039 659.7280 3.9896 26.4212 13.8864 25.6739 9.6278 2.5904 8.7979 5.5969 6.5118 14.9337 8.2374 24.4979 3.4910 6.4855 11.3408 14.3675 9.4832 3.9758 3.4692 9.2523 3.8823 4.3070 13.7451 2.6040 5.1699 0.6529 3.7984 19.3679 10.3450 7.8611 6.8106 6.1438 3.4430 100.3328 86.5156
temp: 298.150 k
press: 1.00000 atm
elementType: 6 6 6 6 6 6 6 6 1 1 1 1 7 1 6 8 6 1 1 6 1 1 6 1 6 1 1 6 1 7 6 1 6 1 6 6 1 7 6 6 6 6 6 6 1 6 1 6 1 6 1 6 1 6 1 1 6 1 1 6 1 1 6 1 1 1 1 1 1 1 1
symmnumber: 1
zpe: 1626321.9 jmol-1
zpe.correction: 0.619433 hartree
zpe.thermalcorrener: 0.648496 hartree
zpe.thermalcorrenthalpy: 0.649440 hartree
zpe.thermalcorrgfe: 0.558097 hartree
zpe.sumelectzpe: -1478.584989 hartree
zpe.sumelectthermal: -1478.555926 hartree
zpe.sumelectthermalent: -1478.554982 hartree
zpe.sumelectthermalfe: -1478.646325 hartree
dipole: -30.5533 -26.2932 -33.4231
dipole: 52.3635
quadrupole: -57.5453 -74.0874 -38.5371
quadrupole: 82.1111 127.4417 77.0506
quadrupole: -0.8220 -17.3641 18.1862 82.1111 127.4417 77.0506
hfenergy: -1479.2044219 hartree
pointgroup: C01 [X(C32H35N3O1)]
dipole: -4.1105448 -1.7101442 -4.7860584 debye
polarizability: 474.2186441|61.1524706|498.9176864|40.5361184|-9.4491561|439.4765198 unknown
InChI: InChI=1/32C.3N.O.35H
charge 2 multiplicity 1
71 atoms
C  1.4876678 -2.14025574 -0.1162702
C  0.56562721 -1.92331837 -1.16211396
C  0.42365645 -0.65273149 -1.72844489
C  1.19489139 0.38751709 -1.22817524
C  2.09184175 0.15884643 -0.1781874
C  2.26036985 -1.1023787 0.39110137
C  0.65874939 -4.27436834 -0.65788723
C  -0.06631728 -3.19855997 -1.4491067
H  -0.2445356 -0.4605025 -2.56053001
H  1.10670723 1.37843434 -1.65834994
H  2.68514824 0.98475066 0.19976761
H  2.96198506 -1.274969 1.19516965
N  1.45325784 -3.48184766 0.28532139
H  1.30702307 -4.92412998 -1.25174492
C  1.79590228 -3.98584748 1.52531381
O  2.48632166 -3.36166626 2.31295321
C  1.15338016 -5.32538754 1.8151359
H  1.6347811 -6.10801932 1.21653029
H  1.327714 -5.5545464 2.86640413
C  -0.35054396 -5.25282382 1.49451732
H  -0.80934509 -4.4782851 2.11742989
H  -0.83249749 -6.19707318 1.75300082
C  -0.55906937 -4.93389068 0.00467829
H  -0.81938222 -5.8413585 -0.54482682
C  -1.53978875 -3.81027913 -0.34317047
H  -2.57539589 -4.05714893 -0.58211191
H  -1.50915317 -2.93403229 0.30606917
C  -1.16814905 -3.53433705 -2.24412164
H  -1.30955961 -4.57428304 -2.52663782
N  -1.89922829 -2.63352579 -2.94228647
C  -3.19930408 -2.98802468 -3.49474047
H  -1.78332771 -1.65762689 -2.70330753
C  -3.44404829 -2.02015029 -4.69728403
H  -3.09374044 -3.99510933 -3.90875918
C  -4.31015152 -3.03091171 -2.45501795
C  -3.26443949 -0.55696337 -4.34655453
H  -2.71522547 -2.28162316 -5.46882137
N  -4.7887265 -2.28987903 -5.32092073
C  -5.22474284 -4.08828045 -2.47944811
C  -4.41883068 -2.06544104 -1.44738198
C  -2.05754862 0.05880002 -4.69409011
C  -4.2323606 0.18366706 -3.65983707
C  -5.1739698 -1.28626508 -6.39784348
C  -4.9211711 -3.67727607 -5.95792715
H  -5.49100195 -2.23237819 -4.57728013
C  -6.25294764 -4.16204326 -1.54082318
H  -5.11994792 -4.88057142 -3.21593427
C  -5.44026813 -2.14156881 -0.50605217
H  -3.70229551 -1.25280972 -1.38156211
C  -1.81122058 1.3840491 -4.34144098
H  -1.3043602 -0.49992159 -5.24303952
C  -3.99113378 1.51099539 -3.31884036
H  -5.1826468 -0.26087215 -3.37992103
C  -6.08234227 -2.07400423 -7.32239029
H  -4.25034523 -0.98836263 -6.89827748
H  -5.62629618 -0.41579877 -5.92812728
C  -5.38399915 -3.43097793 -7.3932676
H  -5.65963851 -4.22856646 -5.37725323
H  -3.96068341 -4.18651147 -5.8968616
C  -6.36461672 -3.1850887 -0.5554632
H  -6.95247363 -4.99042896 -1.57261483
H  -5.51119033 -1.38732718 0.27044611
C  -2.77776756 2.11136976 -3.65134417
H  -0.86916636 1.84698592 -4.61538712
H  -4.75243636 2.07467423 -2.79064184
H  -7.0855301 -2.1652926 -6.89511667
H  -6.16802977 -1.58590444 -8.29385901
H  -6.03734094 -4.23498429 -7.7333323
H  -4.5239384 -3.38096784 -8.06613577
H  -7.15903969 -3.24285006 0.18091724
H  -2.59138542 3.14525507 -3.38121176
