program: Gaussian 16
title: Title Card Required
version: ES64L-G16RevC.02
method: UwB97XD
basis: 6-31+G(d,p)
operation: Freq
keyword: #P
keyword: Geom=AllCheck
keyword: Guess=TCheck
keyword: SCRF=Check
keyword: GenChk
keyword: UwB97XD/6-31+G(d,p)
keyword: Freq
converged: YES YES YES YES
polarizability: 6.13315547e+02 4.60935400e+01 5.09324775e+02 7.63728324e+01 -3.91595556e+01 4.86716967e+02
1716.lowfreq: -1.3565 -0.0002 0.0006 0.0008 5.4119 6.5042 14.9245 18.7336 21.6705
frequency: 13.8795 18.5410 21.5797 33.1418 36.4058 51.1783 58.5355 62.6285 65.6188 75.2167 82.9644 101.3429 109.8823 112.9645 123.1339 134.2304 146.8752 181.2920 199.7726 215.1020 226.4862 232.3988 253.6766 257.1912 276.8942 288.0465 289.9058 309.2843 335.7516 341.8254 359.3873 399.4732 409.0511 418.4684 432.8931 436.1809 443.3255 465.3247 470.0910 493.5452 514.7969 536.4955 551.7304 554.6197 566.1808 572.8952 583.6917 596.6913 613.8166 626.9318 634.4805 635.9720 662.9319 670.5963 675.3768 703.7930 719.8838 726.4574 740.3516 758.2998 766.6981 772.8667 778.0865 785.5768 787.9950 803.5379 812.5731 822.5905 842.5500 846.4536 856.2157 873.3850 878.7261 885.1899 887.2455 892.5296 896.3201 943.4443 951.6710 961.6345 969.3724 975.1958 977.7878 983.8653 989.4294 993.2464 1008.9679 1012.1029 1023.7206 1024.0965 1026.0040 1027.8636 1035.0135 1039.2836 1045.5606 1046.5862 1055.5033 1062.5886 1066.3130 1067.1466 1073.9616 1085.6841 1112.8105 1118.6676 1129.1846 1135.1919 1136.9171 1148.3649 1166.7645 1174.2944 1195.9202 1196.7707 1197.5859 1210.1153 1214.4803 1217.8984 1220.9408 1222.6427 1228.2900 1230.6828 1242.3963 1262.3671 1264.3316 1271.3869 1273.8691 1284.1905 1289.5460 1297.9000 1309.8823 1333.9323 1345.8344 1347.6453 1350.2691 1355.4585 1365.3281 1369.6075 1372.0836 1377.4886 1378.8408 1382.9695 1384.1079 1393.1899 1398.5304 1402.7631 1406.4734 1410.0834 1420.2166 1429.6304 1455.6720 1470.3277 1481.3949 1485.4244 1493.1389 1504.8324 1505.6368 1507.3049 1510.7858 1511.3871 1516.7598 1530.3568 1531.0228 1548.8450 1552.3389 1563.9621 1625.3752 1663.9930 1666.3447 1667.6123 1684.9743 1686.2914 1698.7352 1812.7215 3081.3120 3092.3656 3102.4071 3106.8019 3107.8757 3108.3550 3116.3721 3122.8359 3132.5495 3144.5092 3158.5819 3174.4705 3177.8365 3179.8243 3181.3090 3206.0029 3207.9635 3215.5104 3217.9795 3218.1660 3219.8601 3221.9787 3228.8700 3229.8259 3230.5773 3237.3076 3237.4496 3238.0902 3246.3783 3246.9882 3249.1872 3289.7977 3290.3744 3467.6992 3624.2145
redmass: 5.1129 4.8109 5.4384 4.3817 5.0510 3.5726 4.5522 3.8569 2.9319 4.6980 3.3783 3.0395 3.7867 3.9758 4.1692 2.9480 4.8372 4.2897 3.1578 3.5862 2.9787 1.7735 2.8286 3.6010 3.7115 3.7736 1.8651 3.6510 3.9703 3.5637 4.5248 3.1173 5.5935 2.9173 3.0056 3.3687 3.0763 4.1623 2.8970 3.4838 3.2228 3.4296 5.3413 3.3618 3.9243 2.2143 2.8038 3.0003 4.1960 3.4718 6.4071 6.1886 2.3336 2.3473 2.5860 4.1972 3.7491 1.7435 1.6297 3.1338 3.5722 1.7068 2.1539 2.4052 4.9528 2.5846 3.5337 3.2745 1.9113 1.7665 3.8375 1.3807 2.3725 2.0685 1.4385 1.3868 2.3421 1.8984 1.9512 1.6265 2.5152 1.5254 1.5780 1.5741 1.3453 1.9850 2.0959 1.4800 4.7211 4.3902 2.8249 1.5250 1.3390 1.3295 1.6400 2.1346 2.4428 2.7643 2.0878 2.2424 2.1359 1.9499 2.1123 1.8487 1.5742 2.4384 1.7373 2.5484 1.7612 2.1129 1.3546 1.1230 1.1426 1.3993 1.5731 1.5224 1.3805 1.4954 1.1761 1.4896 1.4221 1.7994 1.5254 1.5714 1.5192 1.2654 1.9085 1.2689 1.8221 1.6662 1.5468 1.6349 1.4834 1.8926 1.7319 2.0945 1.5211 1.6958 1.4563 1.5751 1.4375 1.4004 2.8445 1.3862 1.3899 1.3929 1.2741 3.2321 1.5431 1.3368 1.1348 1.1833 2.2883 1.3376 1.6174 1.3630 1.0898 1.4760 1.0969 2.2835 1.1320 2.2573 2.2454 3.6427 6.0393 5.6804 5.6359 5.7473 5.7540 5.6830 4.0592 11.8922 1.0696 1.0841 1.0680 1.0638 1.0696 1.0795 1.0869 1.0872 1.0640 1.0607 1.1054 1.1014 1.0519 1.1045 1.0975 1.0906 1.0913 1.1085 1.1025 1.0920 1.0937 1.0876 1.0906 1.0903 1.0885 1.0949 1.0946 1.0929 1.0995 1.0994 1.0976 1.0949 1.1199 1.0772 1.0765
irintensity: 0.6739 3.5023 0.9539 0.4988 9.4025 0.1972 1.9556 0.6175 0.5785 1.2581 1.3280 2.2008 0.3842 0.4621 4.4334 1.7951 1.6831 3.0965 7.1069 5.7481 10.1820 2.8951 4.5571 10.5532 7.7025 3.0079 2.9843 7.4664 0.8255 18.5698 1.3084 4.8525 3.9986 1.4718 1.2683 16.0019 5.2418 11.8452 4.8245 30.5267 10.1995 11.2605 15.7016 4.4180 12.9338 11.1652 0.6292 4.0799 24.1001 37.3677 0.3027 0.5617 146.6452 44.6773 35.3343 5.7999 44.1301 181.5680 102.9227 7.9101 27.5739 80.3873 12.6285 22.1891 89.4519 70.4797 34.7565 2.8709 0.5538 39.6713 371.9390 3.4004 6.5054 10.0116 5.2301 0.5024 1.2853 22.1601 2.5896 1.0554 19.9975 36.5003 15.4743 3.2988 2.7779 38.6630 2.1978 2.6149 5.9014 7.1480 36.3029 5.4278 0.8353 0.1086 19.0008 31.3143 89.3639 16.0643 144.4962 5.1724 6.2258 34.6150 4.1949 3.7050 4.0796 47.4984 37.9554 130.9215 148.7469 71.8261 125.0874 1.6246 11.1693 108.2031 2.3770 56.5141 16.9131 6.5622 6.5363 18.3738 123.8700 7.2155 15.0875 22.0743 1.7962 3.7539 103.6598 11.9502 421.3518 30.3260 1.0503 9.1510 22.1260 9.1096 250.4327 4.0793 92.2952 27.3254 147.5287 53.5970 107.5138 130.8789 8.7907 34.0190 4.9189 34.4751 60.0744 474.3333 56.4156 86.4182 3.6689 24.1628 176.8650 14.2437 29.4960 22.5083 16.3128 6.6340 10.5099 525.1667 11.3956 8.5648 11.0322 43.2694 136.1680 382.4063 14.1440 45.6615 1.4804 2.4831 1248.0934 609.4977 5.4346 6.7363 13.3627 42.6722 25.3810 17.4101 1.6268 7.7986 6.0466 8.8266 11.8527 3.4133 7.3761 10.9339 7.6890 4.1618 10.5336 4.8719 4.0768 1.5266 5.9107 1.4571 3.5162 3.8029 1.6180 23.5756 9.4492 1.2206 9.5597 4.9523 9.3677 6.3113 1.1792 133.6812 411.8609
temp: 298.150 k
press: 1.00000 atm
elementType: 6 6 6 6 6 6 6 6 1 1 1 1 7 1 6 8 6 1 1 6 1 1 6 1 6 1 1 6 1 7 1 6 6 6 6 6 6 1 1 1 1 1 6 1 6 1 6 6 6 6 1 6 1 6 1 1 1 6 6 6 1 1 6 1 1 1 1 1 1 7 1
symmnumber: 1
zpe: 1616327.0 jmol-1
zpe.correction: 0.615626 hartree
zpe.thermalcorrener: 0.646528 hartree
zpe.thermalcorrenthalpy: 0.647472 hartree
zpe.thermalcorrgfe: 0.550789 hartree
zpe.sumelectzpe: -1478.564549 hartree
zpe.sumelectthermal: -1478.533647 hartree
zpe.sumelectthermalent: -1478.532703 hartree
zpe.sumelectthermalfe: -1478.629387 hartree
dipole: -40.3277 -23.1156 -32.8163
dipole: 56.8996
quadrupole: 21.8372 -93.1400 -25.1077
quadrupole: 99.5399 173.5616 66.0015
quadrupole: 53.9740 -61.0031 7.0291 99.5399 173.5616 66.0015
hfenergy: -1479.1801753 hartree
pointgroup: C01 [X(C32H35N3O1)]
dipole: -4.5165264 -1.0242451 -4.0232388 debye
polarizability: 613.3155465|46.09354|509.3247745|76.3728324|-39.1595556|486.7169672 unknown
InChI: InChI=1/32C.3N.O.35H
charge 2 multiplicity 1
71 atoms
C  0.71629845 -2.30180125 -0.75362572
C  -0.51208748 -1.9656921 -1.39819645
C  -0.70267373 -0.64819799 -1.87046732
C  0.31174946 0.26932517 -1.71204211
C  1.52588011 -0.09289883 -1.08521116
C  1.74728884 -1.36747587 -0.59705612
C  -0.66193892 -4.15510556 -0.55019228
C  -1.32666535 -3.13271974 -1.40431088
H  -1.63028453 -0.32252133 -2.32721157
H  0.17708657 1.28592542 -2.06372499
H  2.30537749 0.65372689 -0.97879668
H  2.67432106 -1.64240162 -0.11487522
N  0.67823033 -3.62440384 -0.36070857
H  -0.63711614 -5.14472777 -1.0152303
C  1.56078827 -4.26246705 0.51562261
O  2.65526669 -3.80114305 0.77114938
C  0.9964627 -5.5424866 1.07682365
H  0.98855262 -6.27895219 0.26448188
H  1.69027127 -5.90694745 1.83377818
C  -0.42756186 -5.37533395 1.65804333
H  -0.35266705 -5.07790591 2.70623092
H  -0.92045669 -6.3493895 1.6409275
C  -1.30574508 -4.33900194 0.90803356
H  -2.30244938 -4.75164673 0.72191536
C  -1.42414979 -3.04536831 1.60723172
H  -0.67008996 -2.7225738 2.31802861
H  -2.23381946 -2.36196031 1.37505804
C  -2.53946891 -3.39337274 -2.0253495
H  -3.02824764 -4.34792955 -1.84788386
N  -3.17366094 -2.56593393 -2.84982715
H  -2.75964906 -1.66563267 -3.05863698
C  -3.04511656 -0.05704141 -4.93069209
C  -4.29794482 -0.51881233 -4.51326903
C  -5.18442081 0.37315882 -3.89900323
C  -4.81648485 1.69942056 -3.69934261
C  -3.55733833 2.14748319 -4.09818957
C  -2.67202032 1.26870607 -4.71597586
H  -2.35611658 -0.7328053 -5.43111132
H  -6.16579567 0.04743229 -3.56811505
H  -5.51370171 2.38271614 -3.2268613
H  -3.27284294 3.18146841 -3.93513534
H  -1.69555632 1.61135838 -5.0409871
C  -4.6147532 -1.98766029 -4.69805582
H  -3.89021851 -2.41523217 -5.39656267
C  -4.51275237 -2.8080988 -3.3696591
H  -4.56961651 -3.86988425 -3.62804886
C  -5.59621843 -2.50691619 -2.34573728
C  -6.78030893 -3.24970776 -2.37146487
C  -5.44117439 -1.50535188 -1.38308254
C  -7.81289964 -2.96860386 -1.4783023
H  -6.89161806 -4.07807419 -3.0661564
C  -6.4675367 -1.23208869 -0.48438703
H  -4.52100634 -0.93275969 -1.32919834
C  -7.65899967 -1.95489536 -0.53644363
H  -8.72547455 -3.55397298 -1.50924523
H  -6.3359275 -0.45234976 0.2582529
H  -8.45739955 -1.73839827 0.16520076
C  -6.21570382 -1.28006628 -6.52896983
C  -6.16815583 -3.63525713 -5.86500774
C  -7.1095565 -2.09384291 -7.44570609
H  -5.24852193 -1.07456128 -6.99147409
H  -6.64313521 -0.35023217 -6.15980959
C  -6.49540327 -3.48933279 -7.34913183
H  -7.0001564 -4.0597663 -5.30467117
H  -5.26988189 -4.21981162 -5.67325359
H  -8.14304209 -2.08932621 -7.08651575
H  -7.09747313 -1.69033204 -8.45878586
H  -7.16884632 -4.28177145 -7.67693162
H  -5.58241104 -3.54602743 -7.94795274
N  -5.95435776 -2.20796039 -5.34885437
H  -6.67740542 -2.02646957 -4.64509268
