program: Gaussian 16
title: Title Card Required
version: ES64L-G16RevC.02
method: UwB97XD
basis: 6-31+G(d,p)
operation: Freq
keyword: #P
keyword: Geom=AllCheck
keyword: Guess=TCheck
keyword: SCRF=Check
keyword: GenChk
keyword: UwB97XD/6-31+G(d,p)
keyword: Freq
converged: YES YES YES YES
polarizability: 5.99859087e+02 6.64544253e+01 5.00599536e+02 8.32084368e+01 -1.76405480e+01 4.48523043e+02
1716.lowfreq: -8.1163 -0.5422 -0.0007 -0.0006 0.0007 6.5090 15.9064 20.3353 23.5055
frequency: 12.9236 19.3651 23.4769 33.1088 41.3362 43.8857 54.3510 61.1690 65.9520 73.0961 82.6665 97.0591 104.2485 112.4396 120.4002 143.4011 156.9846 165.4763 182.7194 202.6253 214.0259 229.4815 247.2353 256.6468 272.9234 284.5423 286.4223 307.0500 317.5437 347.4265 366.0263 387.9567 410.5042 419.6755 428.3327 435.4127 436.5718 463.9286 473.2703 494.5085 514.7766 522.6252 538.2316 546.7839 553.8697 564.9820 581.2130 595.5313 604.0961 621.9578 633.4620 634.4454 655.4869 662.6361 672.7952 706.0577 715.9248 728.6502 731.2663 746.7521 765.4608 772.6864 772.9471 784.5926 797.7804 804.5714 815.3814 833.7881 848.6432 857.9700 874.6613 880.1988 880.9629 884.6643 888.2682 893.7828 944.1001 946.7660 951.5404 961.8855 971.5404 973.2868 981.8823 983.3059 990.1058 1008.4954 1016.0303 1017.3161 1023.7449 1024.3647 1027.0213 1035.3346 1039.0088 1041.4265 1042.1067 1044.5950 1058.9949 1061.0301 1066.5337 1073.6323 1082.6537 1095.3820 1109.6550 1121.9629 1126.6539 1128.9810 1133.9966 1148.4618 1162.7491 1193.0313 1197.1316 1197.9979 1202.4283 1211.5496 1216.3578 1221.3563 1224.0620 1225.0582 1228.0924 1231.7614 1247.2413 1260.7825 1271.0103 1275.1489 1279.3974 1282.8452 1297.6647 1304.7731 1331.8403 1334.7204 1344.6826 1347.5097 1354.1671 1356.9693 1366.1718 1370.6055 1372.3695 1374.4300 1380.2810 1385.8727 1390.7840 1392.2676 1394.6429 1402.7283 1405.9214 1409.0693 1414.5143 1435.6149 1461.2653 1473.5534 1476.4834 1482.8827 1490.6186 1505.0776 1505.2611 1506.0945 1507.3116 1508.5061 1512.4139 1528.2749 1528.7319 1548.8261 1551.1200 1564.8339 1623.3705 1664.3614 1666.0300 1667.1735 1684.4153 1685.2798 1707.7211 1810.0018 3059.9844 3079.8450 3095.0801 3097.4372 3101.2030 3106.9193 3108.3237 3122.6749 3134.3255 3141.0880 3154.6512 3171.4344 3173.3503 3175.5337 3178.6898 3209.9843 3210.8608 3214.1501 3218.2864 3218.5609 3219.3735 3222.3033 3228.7963 3229.4376 3234.1079 3236.9185 3239.4231 3242.2144 3246.6211 3247.5318 3252.9906 3285.9769 3289.8691 3467.8067 3627.3103
redmass: 5.1245 4.7310 5.3539 4.3312 3.1059 2.6799 5.0929 4.3368 4.2631 4.1586 4.4615 3.0951 3.9620 4.1874 4.4521 4.2775 1.2234 2.1158 4.3162 3.3710 4.2181 5.4553 3.5376 4.3941 3.8394 1.8409 4.0285 3.2650 4.1937 3.9103 4.0883 2.9017 5.6006 2.9279 2.9238 3.0413 3.1090 4.2355 2.9208 2.9326 2.6756 2.4959 3.3497 3.6691 3.0287 4.4412 2.8371 2.9728 3.5384 4.5775 6.2298 6.2869 3.9242 3.1042 1.9328 4.1503 4.1110 1.8154 1.4701 3.2341 3.1181 2.0846 2.3258 2.0236 3.3397 3.3246 3.4083 3.3188 1.7812 1.9602 2.5207 1.2978 1.3156 1.9938 1.4261 2.7847 2.0308 2.4175 2.0670 1.3856 1.5401 1.3751 1.7575 2.4552 1.3385 2.2192 1.5477 1.4326 4.8939 4.0912 3.1404 1.3403 2.9750 1.3419 1.3267 3.0734 2.3169 2.7624 2.2073 2.0864 1.8343 2.1227 2.4306 2.2131 2.0520 1.6789 1.7134 2.6821 1.8724 1.6344 1.1192 1.1217 2.2929 1.6146 1.5199 2.1077 1.1347 1.2158 1.4449 1.4083 1.5227 2.0775 1.6764 1.4265 1.4242 1.3042 1.2833 1.8976 1.6294 1.3686 1.5099 1.7208 1.4040 1.8030 1.7302 1.5628 1.9060 1.7747 1.4019 1.5780 1.3007 1.3755 1.4537 2.6641 1.3882 1.3894 1.3798 3.3107 1.6735 1.3025 1.1856 1.1234 2.2880 1.3745 1.2411 1.4657 1.0915 1.6355 1.1576 1.7266 1.2966 2.2386 2.2645 3.7871 5.9287 5.8214 5.6700 5.6967 5.7121 5.7290 4.1114 11.8831 1.0835 1.0693 1.0773 1.0721 1.0679 1.0853 1.0641 1.0871 1.0640 1.0614 1.1033 1.0512 1.1019 1.0978 1.1044 1.0905 1.0936 1.1064 1.1081 1.0920 1.0887 1.0884 1.0909 1.0909 1.0883 1.0952 1.0952 1.0913 1.0995 1.0995 1.0974 1.1200 1.0951 1.0778 1.0764
irintensity: 0.1061 0.2056 1.0785 0.2928 1.8459 1.0309 1.1067 2.5455 1.1438 0.4819 0.1986 1.7040 0.4646 0.5137 2.1723 1.4335 1.2234 5.0924 3.0681 3.8312 1.3581 7.9968 1.0088 4.8639 2.3704 2.5910 7.4046 5.2840 2.1994 5.6992 1.4565 2.4999 0.6748 1.4273 0.5912 7.2181 2.6597 10.2784 1.7795 16.4303 3.9406 60.8884 5.1534 34.6538 33.1941 11.6128 3.8619 6.4738 8.6359 64.5042 1.4431 1.1643 9.8159 62.9110 67.2867 4.1440 68.9362 20.5887 204.5213 8.7868 29.1287 32.6126 44.4538 2.8729 2.8558 49.9217 11.3737 10.1585 3.4469 14.9184 18.4822 0.5628 1.8278 5.1392 7.0542 2.7083 12.7850 48.5239 5.4378 1.3555 10.9239 36.2310 4.7785 2.2250 3.6035 20.8845 3.5319 0.2443 4.5520 7.1301 40.8362 1.0596 6.2521 0.8282 0.7543 56.0454 23.4525 10.7128 4.6629 9.8231 19.5555 0.6653 38.0393 34.1930 103.4884 54.6332 41.7037 174.0816 117.9337 184.4367 0.1431 0.1645 10.6194 158.2496 2.1039 14.2438 2.9374 1.9364 16.7580 74.8090 34.2291 11.4681 13.4080 3.7425 6.0775 8.0526 7.6568 524.4160 46.4416 105.6054 0.1072 11.9787 2.5504 12.9561 167.7011 10.3070 5.5790 11.4420 69.5500 219.5892 25.4541 19.8899 273.1292 70.5590 5.8812 20.1804 41.0635 505.3947 185.7179 128.3278 0.6776 18.5357 192.9757 44.0298 18.8037 35.0580 6.1148 2.0614 9.6696 596.2942 170.9028 7.4831 14.5559 62.1031 131.3919 164.9972 12.8050 2.6168 0.4407 1.0426 850.9865 650.4684 3.8474 7.0514 19.9278 23.6427 14.2629 21.1877 19.3709 5.6041 6.1675 7.8483 19.5245 5.9716 3.1145 7.7356 11.1876 3.3748 8.6173 4.7778 2.7927 2.2782 4.9849 3.0893 2.7967 4.7759 1.4494 15.4436 10.7287 4.0757 9.8968 4.3003 5.1349 3.3566 5.1960 121.5814 348.9301
temp: 298.150 k
press: 1.00000 atm
elementType: 6 6 6 6 6 6 6 6 1 1 1 1 7 1 6 8 6 1 1 6 1 1 6 1 6 1 1 6 1 7 1 6 6 6 6 6 6 1 1 1 1 1 6 1 6 1 6 6 6 6 1 6 1 6 1 1 1 6 6 6 1 1 6 1 1 1 1 1 1 7 1
symmnumber: 1
zpe: 1616119.9 jmol-1
zpe.correction: 0.615548 hartree
zpe.thermalcorrener: 0.646629 hartree
zpe.thermalcorrenthalpy: 0.647573 hartree
zpe.thermalcorrgfe: 0.549370 hartree
zpe.sumelectzpe: -1478.563626 hartree
zpe.sumelectthermal: -1478.532545 hartree
zpe.sumelectthermalent: -1478.531600 hartree
zpe.sumelectthermalfe: -1478.629804 hartree
dipole: -40.1206 -22.5750 -34.3154
dipole: 57.4181
quadrupole: 24.0484 -95.3090 -25.7725
quadrupole: 97.9003 173.1201 67.0433
quadrupole: 56.3928 -62.9647 6.5719 97.9003 173.1201 67.0433
hfenergy: -1479.1791737 hartree
pointgroup: C01 [X(C32H35N3O1)]
dipole: -4.4898361 -0.8485731 -4.6618702 debye
polarizability: 599.8590868|66.4544253|500.5995358|83.2084368|-17.640548|448.5230431 unknown
InChI: InChI=1/32C.3N.O.35H
charge 2 multiplicity 3
71 atoms
C  0.67336815 -2.12984894 -0.61334422
C  -0.451406 -1.90114758 -1.46441758
C  -0.60562135 -0.6327726 -2.07049244
C  0.33979064 0.33879688 -1.83572723
C  1.4519145 0.08047923 -1.00121123
C  1.63670764 -1.14205103 -0.38136434
C  -0.57751239 -4.10527052 -0.58644071
C  -1.2259102 -3.09034971 -1.48749021
H  -1.4465488 -0.38736408 -2.70829406
H  0.23223632 1.3157142 -2.29305655
H  2.18080946 0.86726205 -0.8394506
H  2.4843491 -1.33660078 0.25966909
N  0.60831992 -3.40513099 -0.10422414
H  -0.26304101 -4.97892684 -1.17290486
C  1.46320751 -4.01850553 0.81014437
O  2.4784844 -3.47908863 1.20531152
C  0.96124989 -5.37443026 1.23734296
H  1.11111183 -6.07607358 0.40776007
H  1.58164382 -5.7135206 2.0669935
C  -0.52214385 -5.31983003 1.6451525
H  -0.59526275 -4.80207071 2.60549492
H  -0.87952758 -6.33772612 1.81152009
C  -1.44630928 -4.59770892 0.61782744
H  -2.15240055 -5.32069358 0.19701695
C  -2.20928992 -3.47526553 1.2404982
H  -1.70824585 -2.77858804 1.90602817
H  -3.24131205 -3.28097671 0.96895148
C  -2.41171103 -3.39465569 -2.14990692
H  -2.8845734 -4.35546299 -1.96393658
N  -3.04949653 -2.59694704 -2.99662137
H  -2.66222397 -1.68473258 -3.20473443
C  -2.96727758 -0.13462182 -5.13604042
C  -4.18590053 -0.54275211 -4.58281612
C  -4.9478887 0.37963714 -3.85650922
C  -4.49048322 1.68118484 -3.67930919
C  -3.26540057 2.07519663 -4.21677756
C  -2.50503672 1.16695612 -4.94812284
H  -2.37441704 -0.83446646 -5.71902809
H  -5.9008239 0.09755613 -3.42015462
H  -5.09192481 2.38759964 -3.11761815
H  -2.91076272 3.09007984 -4.07247086
H  -1.55667071 1.46767182 -5.38010554
C  -4.59932944 -1.99019722 -4.75690005
H  -3.97372589 -2.43522049 -5.5361596
C  -4.40887686 -2.84921217 -3.46168395
H  -4.45759865 -3.90323245 -3.75050641
C  -5.43390951 -2.61439733 -2.36115327
C  -6.56088767 -3.43929478 -2.29864248
C  -5.26556521 -1.61567296 -1.39660486
C  -7.53109797 -3.24008741 -1.31810675
H  -6.67108886 -4.26653044 -2.99447605
C  -6.22989025 -1.4232252 -0.41229793
H  -4.37992884 -0.98820615 -1.40151284
C  -7.36910579 -2.226899 -0.37710549
H  -8.39956549 -3.88874702 -1.28105003
H  -6.08842452 -0.6462811 0.33141268
H  -8.11821312 -2.07431018 0.39240259
C  -6.330671 -1.15113129 -6.40311515
C  -6.377707 -3.5166735 -5.77440419
C  -7.32561892 -1.90354284 -7.2670422
H  -5.39591015 -0.97063532 -6.93648996
H  -6.68987639 -0.21499009 -5.98138372
C  -6.77705828 -3.32842621 -7.23422756
H  -7.21463123 -3.86560388 -5.17064871
H  -5.5282826 -4.18274422 -5.6345182
H  -8.33054063 -1.85658062 -6.83704273
H  -7.36287788 -1.48117078 -8.27183694
H  -7.50663365 -4.08090947 -7.53503191
H  -5.9035358 -3.41769721 -7.88591114
N  -6.01128865 -2.11735252 -5.26640028
H  -6.64068992 -1.90429267 -4.48640403
