program: Gaussian 16
title: Title Card Required
version: ES64L-G16RevC.02
basis: 6-31+G(d,p)
method: UwB97XD TD-FC
operation: Freq
keyword: #p
keyword: td=(nstates=30,root=6)
keyword: uwb97xD/6-31+G(d,p)
keyword: nosymm
keyword: SCRF=(CPCM,solvent=chloroform)
keyword: density=current
keyword: geom=checkpoint
keyword: guess=readfreq
title: #p td=(nstates=30,root=6) uwb97xD/6-31+G(d,p) nosymm SCRF=(CPCM,solven
basis: NPDir=0 NMtPBC= 1 NCelOv= 1 NCel= 1 NClECP= 1 NCelD= 1
basis: NCelK= 1 NCelE2= 1 NClLst= 1 CellRange= 0.0.
basis: One-electron integrals computed using PRISM.
basis: NBasis= 859 RedAO= T EigKep= 1.09D-06 NBF= 859
basis: NBsUse= 854 1.00D-06 EigRej= 8.13D-07 NBFU= 854
converged: NO NO NO NO
polarizability: 6.41816679e+02 7.34798976e+01 6.00954130e+02 6.42495613e+01 -3.38383202e+01 4.54461535e+02
1716.lowfreq: -314.0297 -231.3296 -55.8295 -30.1740 -19.1177 -8.1280 -0.0003 0.0006 0.0008
frequency: -314.0253 -231.1979 -50.3229 -26.2927 9.6734 13.7685 19.9497 27.6362 37.1204 46.7532 53.9539 64.1523 74.0170 89.3497 93.4456 96.3608 107.7104 112.6419 119.2790 162.0951 176.3268 193.1590 206.7560 217.6135 243.0959 254.8039 258.7317 278.8823 286.7228 289.3457 311.6779 335.7147 348.8758 369.5464 410.6435 416.7827 417.9009 422.7413 437.6704 445.7205 457.6829 467.3816 494.8910 522.7304 533.6772 560.9465 575.1301 579.8883 596.2371 604.7373 620.8423 633.7643 635.7114 649.7191 664.1041 686.3536 696.9125 707.4327 717.4691 721.9823 728.5185 733.0131 746.4220 771.2876 773.1209 776.8519 783.3099 790.1112 808.4961 843.0813 849.0039 863.3040 870.7861 873.9132 877.6498 885.0950 894.8125 898.5357 914.4683 943.4882 950.2829 955.9970 966.3875 970.4690 977.6223 981.3271 987.8089 1010.7286 1011.4587 1012.7914 1022.5405 1023.6461 1024.7881 1026.9944 1030.2907 1037.8109 1039.8519 1043.9952 1051.4541 1061.6637 1066.6431 1067.4925 1071.2837 1082.6571 1097.6116 1106.5103 1128.7570 1135.2419 1136.7400 1140.7966 1147.1736 1181.5065 1196.4268 1196.9982 1212.1777 1218.2635 1219.9910 1223.4700 1225.3277 1229.5118 1246.6127 1253.2032 1257.6360 1267.5711 1271.0751 1285.1974 1294.6257 1310.1111 1325.0543 1331.0491 1338.1400 1344.3160 1349.6211 1353.9810 1358.1319 1369.5682 1372.0119 1375.0485 1378.7759 1383.7198 1398.1968 1402.1002 1402.6859 1409.5021 1417.2397 1420.4696 1431.9301 1450.6496 1459.3906 1468.0308 1495.9925 1496.9385 1504.0902 1505.0135 1505.3585 1507.2658 1511.8026 1517.3735 1517.7997 1531.1057 1548.5606 1551.3546 1561.1031 1575.7373 1664.5658 1665.7192 1666.3070 1682.9442 1685.4713 1727.3693 1766.8810 1832.4138 3081.5314 3101.5898 3105.9736 3117.4318 3119.3640 3124.1407 3132.3789 3136.7201 3143.4735 3161.7624 3172.8232 3174.4917 3177.6453 3179.5084 3207.1507 3208.2033 3209.9552 3214.6026 3214.6944 3217.7692 3220.7164 3224.9331 3228.4192 3229.1976 3237.4231 3237.8762 3239.6963 3246.8202 3247.5053 3250.6169 3259.4565 3305.8193 3315.0326 3472.2369 3596.3956
redmass: 9.0251 2.9106 5.2748 6.2462 4.9617 4.9311 4.7149 4.5326 4.6344 3.6775 3.8422 4.2903 3.3143 3.2406 3.3804 3.0422 3.7524 4.1112 4.2639 3.9796 4.1722 3.6313 4.5933 5.0211 4.5156 4.5112 4.4904 3.9656 2.6018 1.8037 3.7875 4.5812 4.2654 3.1199 2.1774 3.6293 4.3056 2.8952 2.3136 2.9970 2.2540 2.6668 3.6539 2.5643 3.4433 3.6399 2.6894 2.9294 2.7343 4.0938 4.2294 6.3541 6.2272 2.1112 2.9314 3.6924 4.3534 2.1854 3.4961 1.6899 1.6068 1.8878 2.4966 3.9125 1.3789 2.2310 1.5863 3.3682 2.8147 2.2667 2.6210 2.1579 1.2766 1.4030 2.1452 2.1149 1.4579 2.7515 2.3451 1.9145 1.8306 1.5361 1.6307 1.3373 1.4756 1.6965 1.4056 2.4790 1.6208 1.4153 3.1493 5.5387 3.8136 1.4108 3.1032 1.3327 1.3304 3.1324 1.2202 2.9577 2.2372 2.4621 2.2328 1.8858 2.2940 2.5061 1.5694 1.6745 2.7747 1.9676 2.2349 1.3200 1.1174 1.1139 1.6575 1.7766 1.6588 1.1715 1.1386 1.5347 1.5062 1.9176 1.3040 1.3406 1.5634 1.2661 1.2636 1.8089 1.5319 1.2307 1.9534 1.4419 1.6656 1.8429 1.6777 2.4224 1.5163 1.7974 1.3665 1.3203 1.3217 2.1709 1.4157 1.3928 1.5502 1.3884 2.4184 1.5927 1.1701 1.3353 1.1248 2.4258 1.6973 1.2436 1.3459 1.5393 1.3177 1.4386 1.3580 1.1053 2.2366 2.2584 4.0624 3.2842 6.2525 5.8650 5.7065 5.7480 5.7198 4.6287 5.6803 11.9200 1.0606 1.0688 1.0636 1.0642 1.0861 1.0868 1.0636 1.1010 1.0609 1.0642 1.0888 1.1012 1.1054 1.1041 1.0898 1.0904 1.0943 1.0910 1.1051 1.1071 1.0881 1.0903 1.0901 1.0909 1.0953 1.0948 1.0933 1.0994 1.0993 1.0960 1.1165 1.0944 1.0954 1.0767 1.0772
irintensity: 198.3505 1.5862 1.3316 3.8897 0.9596 0.3533 0.1432 0.9065 3.9221 0.4843 0.8649 1.5996 1.3930 1.0647 1.3733 0.4755 0.5996 1.7719 0.6049 3.1775 3.9298 5.0255 2.2762 2.2344 4.1986 1.9911 0.5350 9.8549 7.0410 1.7496 3.8487 8.2815 5.6580 9.4748 4.2716 0.3936 3.8361 1.6066 3.5729 7.9010 41.9668 5.9835 33.1780 22.0867 9.9096 12.8980 9.9735 15.3944 2.2564 76.7746 45.4371 0.2700 2.1754 31.4158 76.4698 46.3270 10.8006 11.3951 16.2012 43.6248 146.1646 86.4291 3.1922 25.7211 123.0550 25.4069 11.6196 51.0426 21.5251 9.1610 2.9540 4.5639 0.5569 7.4623 9.1971 8.3919 6.7072 8.0901 73.6502 21.5167 1.2478 3.9456 10.5928 95.5575 10.5105 6.5542 0.9439 25.1761 6.2679 1.9289 8.9753 3.9185 13.6924 1.8543 17.3848 0.2652 1.0442 54.2082 36.4259 15.5675 12.9153 32.5190 0.5676 18.2631 107.8252 11.9711 7.9549 34.9541 333.8752 16.5723 383.6074 294.4292 0.8532 0.1277 5.1940 32.3400 152.6381 1.4986 1.0930 18.4841 79.5449 20.9547 44.3453 65.9305 37.2851 3.9963 13.6575 127.6877 71.5441 2.0493 312.0105 3.6048 22.5911 32.7290 368.6534 1.6296 58.8097 4.2061 25.8901 30.4774 20.0466 98.0650 47.4864 37.5977 98.1147 105.1517 121.1635 48.1046 5.4181 60.4093 17.8510 81.8800 8.9211 19.2254 14.3965 27.8796 6.7217 81.3324 109.3288 10.1616 7.6963 18.1764 54.3347 689.1897 256.7061 64.8463 0.2014 0.0656 0.5643 78.4398 349.3673 693.4528 31.5468 11.1199 24.5838 9.9816 5.0755 13.5044 6.3476 11.2746 8.3750 18.9907 14.9657 4.0832 6.8333 10.9923 17.1100 3.7057 9.8683 6.1890 6.0847 2.5247 3.8337 4.3709 2.3107 3.1940 18.9356 10.2474 2.5690 12.8408 6.6450 19.4048 14.3009 10.9260 13.1343 131.6297 114.2882
temp: 298.150 k
press: 1.00000 atm
elementType: 6 6 6 6 6 6 6 6 1 1 1 1 7 1 6 8 6 1 1 6 1 1 6 1 6 1 1 6 1 7 1 6 6 6 6 6 6 1 1 1 1 1 6 1 6 1 6 6 6 6 1 6 1 6 1 1 1 6 6 6 1 1 6 1 1 1 1 1 1 7 1
symmnumber: 1
zpe: 1601417.7 jmol-1
zpe.correction: 0.609948 hartree
zpe.thermalcorrener: 0.639890 hartree
zpe.thermalcorrenthalpy: 0.640834 hartree
zpe.thermalcorrgfe: 0.545167 hartree
zpe.sumelectzpe: -1478.476685 hartree
zpe.sumelectthermal: -1478.446743 hartree
zpe.sumelectthermalent: -1478.445798 hartree
zpe.sumelectthermalfe: -1478.541466 hartree
hfenergy: -1479.2301774 hartree
pointgroup: C01 [X(C32H35N3O1)]
dipole: -3.0399483 -0.0476642 -4.2857365 debye
polarizability: 641.8166791|73.4798976|600.9541297|64.2495613|-33.8383202|454.4615346 unknown
InChI: InChI=1/32C.3N.O.35H
charge 2 multiplicity 1
71 atoms
C  0.61665161 -2.30763238 -0.59576983
C  -0.53594469 -1.95068379 -1.31956891
C  -0.69495257 -0.63106716 -1.75268914
C  0.29831113 0.29249751 -1.45501709
C  1.4377285 -0.08404949 -0.73373164
C  1.61853637 -1.38937038 -0.29094368
C  -0.64910832 -4.1633677 -0.76434731
C  -1.33892513 -3.16053124 -1.42930337
H  -1.5628627 -0.29636517 -2.31130335
H  0.18746997 1.31939735 -1.78581991
H  2.19963042 0.65572059 -0.51429397
H  2.4998689 -1.67907167 0.26190993
N  0.51216654 -3.68500696 -0.26673057
H  -0.94335886 -5.19425196 -0.64332264
C  1.45022704 -4.42125651 0.52628628
O  2.51321158 -3.91171485 0.7858933
C  1.0251702 -5.75921815 1.07355173
H  0.42061128 -6.33648373 0.37095745
H  1.94954829 -6.31347027 1.24239218
C  0.28380351 -5.58573569 2.42461263
H  0.90813044 -4.98648252 3.09480791
H  0.19850644 -6.58337423 2.8663276
C  -1.08312314 -4.97309421 2.29544547
H  -1.8474504 -5.59613593 1.8296557
C  -1.40370865 -3.74510593 2.70329087
H  -0.67115048 -3.09588342 3.17780224
H  -2.40927217 -3.35336543 2.58447134
C  -2.57423123 -3.42002782 -2.03896108
H  -2.99489639 -4.42055993 -1.97148706
N  -3.27995982 -2.53447938 -2.69488105
H  -2.92383742 -1.58702634 -2.77049573
C  -3.03168391 -0.09366308 -4.83936648
C  -4.31019697 -0.52454718 -4.46961199
C  -5.21494264 0.40023444 -3.93551121
C  -4.84099944 1.72934945 -3.7686992
C  -3.55804871 2.1475427 -4.12079231
C  -2.65362856 1.23539891 -4.65760219
H  -2.32629689 -0.7965492 -5.27493383
H  -6.21591978 0.09811462 -3.64288226
H  -5.55235574 2.43785681 -3.35862147
H  -3.26876945 3.18396144 -3.98394298
H  -1.65734643 1.55435685 -4.94426776
C  -4.6405231 -1.99414971 -4.62129809
H  -3.89642148 -2.45417275 -5.27741168
C  -4.60420214 -2.77411081 -3.26358757
H  -4.66099869 -3.84311681 -3.48472785
C  -5.71664419 -2.42062458 -2.29150386
C  -6.90277912 -3.15991658 -2.32706907
C  -5.59147628 -1.37510432 -1.37202099
C  -7.96547128 -2.83409745 -1.48625676
H  -6.99312349 -4.01840632 -2.98719712
C  -6.64849288 -1.05786278 -0.52488465
H  -4.67361395 -0.79959748 -1.30819266
C  -7.84060656 -1.77843981 -0.58721499
H  -8.87933674 -3.416936 -1.52388511
H  -6.53977198 -0.24525686 0.18535157
H  -8.66289393 -1.52680599 0.07386735
C  -6.17064876 -1.32306041 -6.52822438
C  -6.17533892 -3.65695273 -5.79151135
C  -7.0563582 -2.1511017 -7.43983453
H  -5.18809787 -1.1500908 -6.97110983
H  -6.590187 -0.37422809 -6.20107907
C  -6.46629121 -3.55187897 -7.28681283
H  -7.02378417 -4.0573794 -5.2382434
H  -5.28700016 -4.24334739 -5.56262915
H  -8.09701566 -2.12001078 -7.10317704
H  -7.01617571 -1.77915667 -8.4641696
H  -7.14432631 -4.34390717 -7.60596723
H  -5.54088051 -3.64038649 -7.86225765
N  -5.9593314 -2.21702624 -5.31237144
H  -6.70388003 -2.00399388 -4.64051761
