program: Gaussian 09
title: 000050061
version: EM64L-G09RevD.01
frameworkgroup: C1[X(C17H28N2O3)]
method: RPBEPBE
basis: SDD
operation: Freq
keyword: #p
keyword: freq=noraman
keyword: PBEPBE/SDD
title: #p freq=noraman PBEPBE/SDD
converged: YES YES NO NO
title: Mulliken charges:
elementType: O O O N N C C C C C C C C C C C C C C C C C H H H H H H H H H H H H H H H H H H H H H H H H H H H H
charge: -0.320794 -0.311543 -0.277476 -0.091469 -0.446321 -0.360542 -0.347472 -0.408250 -0.355615 -0.297336 -0.693516 0.213880 0.266042 -0.360847 -0.251147 -0.322577 -0.332876 -0.613193 -0.613234 -0.255322 -0.233969 0.251011 0.189287 0.189893 0.190261 0.190954 0.214148 0.213500 0.195503 0.195237 0.209965 0.210055 0.217442 0.210523 0.210782 0.222495 0.194393 0.230531 0.237763 0.247679 0.300646 0.361707 0.228099 0.188407 0.222823 0.188931 0.226841 0.224659 0.223936 0.226111
chargesum: 0.00000
title: Mulliken charges with hydrogens summed into heavy atoms:
elementType: O O O N N C C C C C C C C C C C C C C C C C
charge: -0.320794 -0.311543 -0.277476 -0.091469 -0.084615 0.018638 0.033743 0.019398 0.035125 0.122684 -0.054770 0.213880 0.266042 0.056041 0.217147 -0.074899 -0.032230 0.026135 0.027197 -0.031386 -0.007858 0.251011
polarizability: 2.64556825e+02 -1.23459450e+01 2.63962931e+02 -1.29634139e+00 4.81231547e+00 1.33818292e+02
1716.lowfreq: -4.3599 -0.0008 -0.0003 0.0008 1.6767 5.2785 11.3673 20.3738 21.5822
frequency: 11.3055 20.3429 21.5451 24.9118 35.3794 51.1617 60.3719 72.9486 76.3444 89.8509 102.9012 108.1327 125.3175 142.1194 147.9641 157.6881 185.4800 190.9544 208.2522 220.3286 229.5196 231.2392 246.6121 273.4628 304.1788 319.9886 345.1060 371.1754 413.7522 426.1924 431.1430 455.5774 471.0288 520.0587 557.9284 591.7792 604.7392 685.8109 701.2860 723.5961 724.8612 742.8686 748.6973 754.6075 782.1185 798.7477 806.0217 823.2202 837.3429 853.8765 889.6809 892.7395 919.2382 934.7095 975.5604 978.8151 990.7804 1008.0079 1015.3783 1034.1721 1035.1531 1043.4344 1048.6932 1066.7427 1074.5111 1088.4076 1088.8791 1095.4523 1108.7153 1126.3385 1138.9338 1150.1674 1165.4366 1173.7165 1176.0239 1195.9658 1196.2332 1237.7880 1239.1852 1245.8710 1255.5751 1265.4984 1279.3426 1285.4141 1288.1040 1292.7090 1295.7664 1307.0660 1326.8678 1341.2246 1356.1765 1377.9047 1385.9206 1390.3097 1400.0176 1420.4415 1442.6724 1443.5251 1461.6415 1463.7054 1465.6145 1466.9383 1467.4843 1472.7920 1475.4967 1476.6360 1477.5634 1480.1564 1485.0549 1487.0308 1489.1121 1492.6326 1522.9956 1604.6369 1612.0207 1660.3101 2849.9535 2858.3980 2877.7066 2951.1501 2955.5094 2959.9002 2969.7500 2973.7806 2991.5025 2992.0390 3006.8311 3010.1169 3019.0123 3020.1403 3030.3455 3033.1695 3041.0504 3060.5523 3070.5292 3073.2472 3078.7073 3086.1545 3092.7174 3135.3661 3153.3467 3169.5398 3188.3404 3518.2256
redmass: 2.8669 3.5781 3.8187 4.2623 1.6905 3.9901 5.0040 3.7605 3.5218 2.3614 3.6074 1.8668 2.5058 3.5946 2.3054 3.6028 4.3087 4.2987 5.5273 1.0952 1.5820 1.1391 2.5115 3.1423 4.6855 4.7693 2.5937 3.4628 3.3130 2.6933 3.2634 3.3022 3.5169 4.4196 3.8701 6.7542 6.0094 4.8322 8.0942 2.4212 1.0674 1.6642 1.1391 1.2332 6.2289 1.2129 1.1501 3.9667 5.3775 1.3682 1.7915 1.2254 7.8524 1.3460 8.3088 1.2923 1.1355 7.5312 3.7472 2.3047 1.5749 2.1093 3.0194 1.6109 2.6805 2.1126 1.5149 2.0442 2.0992 2.7765 1.4618 1.4537 2.3550 1.0697 1.5481 2.3579 1.6975 1.7219 1.2916 1.2960 1.9893 2.4490 1.0970 1.2581 1.1152 1.0907 1.3229 1.6426 1.3637 1.4373 1.6335 1.5796 1.4488 1.2143 4.7738 1.1462 2.4455 1.1729 1.0522 1.0871 1.1168 1.1577 1.3716 1.1095 1.1142 1.0624 1.0444 1.1269 1.0633 1.0975 1.0833 1.1461 2.7169 5.8760 6.4889 9.4338 1.0569 1.0601 1.0669 1.0554 1.0587 1.0589 1.0589 1.0364 1.0609 1.0958 1.1025 1.1052 1.0578 1.0724 1.0721 1.1046 1.0888 1.1052 1.1007 1.0993 1.1013 1.1021 1.1065 1.0857 1.0915 1.0970 1.0957 1.0759
irintensity: 0.6037 0.0372 0.1072 0.3317 0.0281 0.3331 0.8955 2.3330 0.7344 2.1368 0.5866 0.6347 0.8833 0.1746 3.0859 1.2049 0.2559 0.0405 3.6061 0.8404 2.8246 0.3017 1.7021 17.3339 1.8444 0.2791 16.8078 0.0477 6.3129 3.7372 3.7886 7.9189 8.6619 0.5638 1.0277 7.5879 1.5857 0.1387 21.8807 10.1001 11.5176 8.6570 45.9807 139.8965 8.5667 5.1225 0.5358 13.8461 6.7799 1.3823 7.1368 0.9389 7.3022 7.2283 96.7662 2.6009 0.2379 225.2048 4.3681 173.2585 18.4674 16.8850 25.9686 15.4100 8.2324 5.6670 5.0047 7.4430 75.9078 10.3592 11.4614 1.2657 338.6058 2.8172 48.4149 120.9007 34.8842 8.6293 4.4474 0.0185 131.8366 12.7256 0.0321 3.1392 0.0010 1.0536 2.7239 32.6583 2.3116 0.6987 0.8228 40.2872 2.8988 11.3199 20.0453 3.7020 183.9580 0.8649 12.3553 2.4375 10.8491 14.0185 78.9349 15.1675 7.7505 8.4137 12.0871 7.7812 18.9669 5.1573 24.8587 35.0405 554.1481 33.3408 119.1545 244.8513 71.6259 120.5685 157.8340 24.4725 6.8266 12.3153 91.3499 34.2936 40.9571 2.8795 13.0458 7.7460 19.6505 39.2095 58.5627 31.7506 9.8726 69.9531 102.9281 53.5885 22.3622 51.7421 39.6719 1.3759 28.4957 16.3863 6.1541 84.9604
temp: 298.150 k
press: 1.00000 atm
elementType: 8 8 8 7 7 6 6 6 6 6 6 6 6 6 6 6 6 6 6 6 6 6 1 1 1 1 1 1 1 1 1 1 1 1 1 1 1 1 1 1 1 1 1 1 1 1 1 1 1 1
symmnumber: 1
zpe: 1121786.2 jmol-1
zpe.correction: 0.427266 hartree
zpe.thermalcorrener: 0.452722 hartree
zpe.thermalcorrenthalpy: 0.453667 hartree
zpe.thermalcorrgfe: 0.366428 hartree
zpe.sumelectzpe: -998.047276 hartree
zpe.sumelectthermal: -998.021820 hartree
zpe.sumelectthermalent: -998.020875 hartree
zpe.sumelectthermalfe: -998.108114 hartree
dipole: -3.6083 -3.0647 0.7119
dipole: 4.7874
quadrupole: -121.3900 -129.4757 -136.6352
quadrupole: -14.2920 4.3277 0.0937
quadrupole: 7.7770 -0.3087 -7.4683 -14.2920 4.3277 0.0937
hfenergy: -998.474542 hartree
pointgroup: C01 [X(C17H28N2O3)]
dipole: 1.3140793 -1.3151302 -0.3021109 debye
polarizability: 266.7313212|12.1275266|261.9197753|2.4131343|1.2314282|133.6869517 unknown
InChI: InChI=1S/C17H28N2O3/c1-4-5-6-9-13-21-16-11-8-7-10-15(16)18-17(20)22-14-12-19(2)3/h7-8,10-11,18H,4-6,9,12-14H2,1-3H3
charge 0 multiplicity 1
50 atoms
O  1.635907 0.736503 0.173847
O  -2.712093 -0.237385 0.191662
O  -3.140221 2.081395 0.205698
N  -5.788003 -2.355605 -0.053558
N  -0.949543 1.173316 0.200512
C  4.636467 -1.621708 0.071101
C  4.746942 -3.162856 0.051363
C  3.170055 -1.133069 0.123484
C  6.205968 -3.66917 -0.016181
C  3.069378 0.393192 0.142982
C  6.30603 -5.209685 -0.036061
C  1.27659 2.099858 0.186316
C  -0.134283 2.331152 0.200804
C  -4.355667 -1.979699 -0.077242
C  -4.176886 -0.483957 0.214254
C  2.181923 3.178647 0.184893
C  -0.618945 3.659105 0.214211
C  -5.995008 -3.78896 0.236229
C  -6.523646 -1.928905 -1.262455
C  1.685595 4.50512 0.198283
C  0.294607 4.739182 0.212888
C  -2.329393 1.120359 0.200789
H  5.135146 -1.209164 -0.830804
H  5.194354 -1.227207 0.945998
H  4.181882 -3.559694 -0.817675
H  4.256979 -3.577826 0.956664
H  2.670068 -1.537534 1.024665
H  2.614589 -1.517072 -0.753895
H  6.771164 -3.271527 0.8515
H  6.693952 -3.254189 -0.921785
H  3.532126 0.836611 -0.763158
H  3.567225 0.816128 1.040201
H  7.357497 -5.546413 -0.090416
H  5.770878 -5.629962 -0.90847
H  5.85739 -5.648488 0.875071
H  -3.830436 -2.550401 0.71001
H  -3.860513 -2.227929 -1.049272
H  -4.658155 0.165423 -0.537766
H  -4.578984 -0.226763 1.209586
H  3.261103 3.001187 0.173693
H  -1.697907 3.827209 0.224813
H  -0.448842 0.279704 0.193928
H  -5.513836 -4.050183 1.195265
H  -5.586958 -4.468995 -0.554673
H  -7.076697 -3.993049 0.331833
H  -6.156297 -2.427327 -2.19609
H  -6.440773 -0.837812 -1.402677
H  -7.595165 -2.16931 -1.144673
H  2.389218 5.34427 0.197265
H  -0.089684 5.764484 0.22334
