program: Gaussian 16
title: Title Card Required
version: ES64L-G16RevC.02
basis: 6-31+G(d,p)
method: UwB97XD
operation: Force
keyword: #p
keyword: uwb97xd/6-31+g(d,p)
keyword: force
keyword: scrf=(CPCM,solvent=chloroform)
keyword: nosymm
keyword: scf=qc
keyword: Guess=mix
title: #p uwb97xd/6-31+g(d,p) force scrf=(CPCM,solvent=chloroform) nosymm scf
basis: NPDir=0 NMtPBC= 1 NCelOv= 1 NCel= 1 NClECP= 1 NCelD= 1
basis: NCelK= 1 NCelE2= 1 NClLst= 1 CellRange= 0.0.
basis: One-electron integrals computed using PRISM.
basis: NBasis= 859 RedAO= T EigKep= 1.07D-06 NBF= 859
basis: NBsUse= 854 1.00D-06 EigRej= 5.68D-07 NBFU= 854
converged: NO YES NO NO
dipole: -40.0354 -22.6182 -34.1704
dipole: 57.2890
quadrupole: 23.6146 -95.0623 -25.8087
quadrupole: 97.6128 173.0403 66.7241
quadrupole: 56.0334 -62.6435 6.6101 97.6128 173.0403 66.7241
hfenergy: -1479.1791072 hartree
pointgroup: C01 [X(C32H35N3O1)]
dipole: -4.456321 -0.8643253 -4.6010187 debye
InChI: InChI=1/32C.3N.O.35H
charge 2 multiplicity 1
71 atoms
C  0.66744082 -2.13111055 -0.61309089
C  -0.45599106 -1.90335714 -1.46633683
C  -0.60996752 -0.63462406 -2.07199188
C  0.33363018 0.33783372 -1.83245941
C  1.44308733 0.08137223 -0.99324534
C  1.6277345 -1.14117264 -0.3749276
C  -0.58260358 -4.10408054 -0.58571191
C  -1.22463896 -3.096703 -1.49671405
H  -1.44804446 -0.38913295 -2.71289966
H  0.22649029 1.31477445 -2.28978695
H  2.16933424 0.86929318 -0.8272029
H  2.4735463 -1.33622624 0.26869254
N  0.60788124 -3.40882098 -0.11293519
H  -0.27967725 -4.98886118 -1.15949892
C  1.46428425 -4.02215494 0.80174148
O  2.48000516 -3.48248136 1.19491611
C  0.96136461 -5.37675211 1.23068027
H  1.10356169 -6.07820825 0.40014539
H  1.5860494 -5.71820814 2.05628615
C  -0.51912203 -5.31661751 1.64897967
H  -0.58192859 -4.80515486 2.61320284
H  -0.88012831 -6.33381019 1.81143497
C  -1.44889594 -4.58433579 0.63483639
H  -2.1645961 -5.29978657 0.21680264
C  -2.19981134 -3.46385277 1.27033058
H  -1.71280598 -2.81335926 1.98977246
H  -3.20842113 -3.21979495 0.95568823
C  -2.40393861 -3.40429583 -2.16712843
H  -2.86962557 -4.37105843 -1.99373832
N  -3.04584007 -2.60131008 -3.00666221
H  -2.66451852 -1.68427478 -3.20241108
C  -2.96830966 -0.13429809 -5.13765199
C  -4.18694155 -0.54248687 -4.58468354
C  -4.94881326 0.3795087 -3.85769983
C  -4.49094927 1.6808656 -3.67988608
C  -3.26598933 2.07496687 -4.21701271
C  -2.50577039 1.16713719 -4.94884673
H  -2.37568784 -0.83394869 -5.7208412
H  -5.90172777 0.09751517 -3.42139066
H  -5.09244295 2.38722571 -3.11769036
H  -2.91115716 3.08985379 -4.07212441
H  -1.55718383 1.46778721 -5.38060393
C  -4.60002492 -1.98989125 -4.76015655
H  -3.97531691 -2.43348984 -5.54082364
C  -4.40704091 -2.85064917 -3.4668183
H  -4.45895112 -3.90415114 -3.75630901
C  -5.42947228 -2.61522007 -2.36357011
C  -6.55662765 -3.43957004 -2.3008813
C  -5.2608111 -1.61679334 -1.39861416
C  -7.52738677 -3.24036875 -1.32087465
H  -6.66678854 -4.26674818 -2.99684234
C  -6.22569554 -1.42394056 -0.41475311
H  -4.37508067 -0.98921817 -1.40278844
C  -7.36545609 -2.22678808 -0.3799115
H  -8.39593145 -3.88856553 -1.28450801
H  -6.08475659 -0.64673529 0.32883901
H  -8.11518421 -2.07352702 0.3886893
C  -6.3319698 -1.1511516 -6.40485272
C  -6.37832699 -3.51665493 -5.77590761
C  -7.32619833 -1.90410624 -7.26915793
H  -5.39699028 -0.97047042 -6.93787324
H  -6.69141542 -0.21504346 -5.98342068
C  -6.77704295 -3.32878306 -7.23591259
H  -7.21501146 -3.86604881 -5.17225117
H  -5.52848943 -4.18228553 -5.63581749
H  -8.33126814 -1.85758673 -6.839594
H  -7.36312002 -1.48194457 -8.2740517
H  -7.50610398 -4.08157858 -7.53698345
H  -5.90307378 -3.41780063 -7.88699756
N  -6.01242988 -2.11715487 -5.26821135
H  -6.64136627 -1.90427635 -4.48771636
