program: Gaussian 16
title: Title Card Required
version: ES64L-G16RevC.02
basis: 6-31+G(d,p)
method: UwB97XD
operation: Force
keyword: #p
keyword: uwb97xd/6-31+g(d,p)
keyword: force
keyword: scrf=(CPCM,solvent=chloroform)nosymm
keyword: scf=xqc
keyword: Guess=mix
title: #p uwb97xd/6-31+g(d,p) force scrf=(CPCM,solvent=chloroform) nosymm scf
basis: NPDir=0 NMtPBC= 1 NCelOv= 1 NCel= 1 NClECP= 1 NCelD= 1
basis: NCelK= 1 NCelE2= 1 NClLst= 1 CellRange= 0.0.
basis: One-electron integrals computed using PRISM.
basis: NBasis= 859 RedAO= T EigKep= 1.07D-06 NBF= 859
basis: NBsUse= 854 1.00D-06 EigRej= 5.69D-07 NBFU= 854
converged: NO NO NO NO
dipole: -40.0887 -22.5814 -34.2543
dipole: 57.3618
quadrupole: 23.7802 -95.2757 -25.6027
quadrupole: 97.7644 173.2308 66.9722
quadrupole: 56.1463 -62.9096 6.7633 97.7644 173.2308 66.9722
hfenergy: -1479.1790518 hartree
pointgroup: C01 [X(C32H35N3O1)]
dipole: -4.4773198 -0.8499702 -4.6340562 debye
InChI: InChI=1/32C.3N.O.35H
charge 2 multiplicity 3
71 atoms
C  0.66766491 -2.13035775 -0.61300909
C  -0.45612474 -1.90352153 -1.46662453
C  -0.6094605 -0.6342564 -2.07157865
C  0.33358052 0.3377368 -1.8326076
C  1.44309691 0.08112161 -0.99348183
C  1.62779444 -1.14117071 -0.37514296
C  -0.58297001 -4.10393113 -0.58517699
C  -1.22431903 -3.09610416 -1.49664992
H  -1.44809531 -0.38909335 -2.71301975
H  0.22669741 1.3146614 -2.28975331
H  2.16953058 0.8693194 -0.82726164
H  2.4734748 -1.3362655 0.26859865
N  0.60826198 -3.40890056 -0.11296977
H  -0.27977884 -4.98956049 -1.1595972
C  1.46434769 -4.02211884 0.80162716
O  2.47958632 -3.48246399 1.19489383
C  0.96145996 -5.37643909 1.23094963
H  1.10371789 -6.07835747 0.40003429
H  1.58593804 -5.71805263 2.05622616
C  -0.51931064 -5.31666112 1.64888004
H  -0.58187367 -4.80506492 2.61339992
H  -0.88006311 -6.33382337 1.81141865
C  -1.44863576 -4.58465369 0.63478043
H  -2.16460162 -5.29984545 0.21675728
C  -2.19930029 -3.46420826 1.2691192
H  -1.71320298 -2.81305242 1.98917669
H  -3.20908809 -3.22057832 0.95620514
C  -2.4040458 -3.40457842 -2.16679712
H  -2.86954141 -4.37094701 -1.9939538
N  -3.04619475 -2.60131399 -3.00697338
H  -2.66429534 -1.6842778 -3.20251626
C  -2.96810531 -0.1339131 -5.13762457
C  -4.18711867 -0.54260195 -4.58458106
C  -4.94866377 0.37956868 -3.85781209
C  -4.4913042 1.68086957 -3.67962229
C  -3.26579891 2.07520564 -4.21707426
C  -2.50588895 1.16693158 -4.94883136
H  -2.37564213 -0.83405858 -5.72088265
H  -5.90175748 0.09749377 -3.421336
H  -5.09230618 2.38715136 -3.11779389
H  -2.91115489 3.08974564 -4.07215533
H  -1.55714702 1.46776173 -5.38060446
C  -4.60013171 -1.98992384 -4.76003698
H  -3.97533423 -2.43352961 -5.54078946
C  -4.40699944 -2.8504925 -3.46664325
H  -4.45896858 -3.90419151 -3.75622888
C  -5.42937136 -2.61517899 -2.36347116
C  -6.55680503 -3.4395825 -2.30077403
C  -5.26067569 -1.61671792 -1.39866159
C  -7.52707391 -3.240038 -1.32078153
H  -6.66678107 -4.2666876 -2.9967868
C  -6.22571421 -1.42367668 -0.41448102
H  -4.37524085 -0.98920296 -1.40268672
C  -7.36569207 -2.22714441 -0.38011612
H  -8.39616495 -3.88868571 -1.28445183
H  -6.08487509 -0.64678633 0.32883131
H  -8.11529412 -2.07351159 0.38881604
C  -6.3319191 -1.15117259 -6.40486987
C  -6.37819319 -3.5166402 -5.77587812
C  -7.32614743 -1.9040907 -7.26914957
H  -5.39689414 -0.97054795 -6.93785332
H  -6.69148598 -0.21494119 -5.98331682
C  -6.77701651 -3.32872665 -7.23578271
H  -7.215055 -3.86604874 -5.17219862
H  -5.52850372 -4.18222409 -5.63578563
H  -8.33125831 -1.85758309 -6.83948314
H  -7.36313788 -1.48189338 -8.27403554
H  -7.50615446 -4.08163608 -7.53695721
H  -5.90305547 -3.41781351 -7.88699682
N  -6.01246082 -2.11715979 -5.26807883
H  -6.64140745 -1.90425441 -4.48772059
