program: Gaussian 16
title: Title Card Required
version: ES64L-G16RevC.02
basis: 6-31+G(d,p)
method: UwB97XD
operation: Force
keyword: #p
keyword: uwb97xd/6-31+g(d,p)
keyword: force
keyword: scrf=(CPCM,solvent=chloroform)
keyword: nosymm
keyword: scf=qc
keyword: Guess=mix
title: #p uwb97xd/6-31+g(d,p) force scrf=(CPCM,solvent=chloroform) nosymm scf
basis: NPDir=0 NMtPBC= 1 NCelOv= 1 NCel= 1 NClECP= 1 NCelD= 1
basis: NCelK= 1 NCelE2= 1 NClLst= 1 CellRange= 0.0.
basis: One-electron integrals computed using PRISM.
basis: NBasis= 859 RedAO= T EigKep= 1.06D-06 NBF= 859
basis: NBsUse= 854 1.00D-06 EigRej= 5.68D-07 NBFU= 854
converged: NO NO NO NO
dipole: -40.1665 -22.6753 -34.1419
dipole: 57.3862
quadrupole: 23.6358 -94.7300 -25.3565
quadrupole: 97.9513 173.3119 66.7535
quadrupole: 55.7860 -62.5798 6.7937 97.9513 173.3119 66.7535
hfenergy: -1479.1787951 hartree
pointgroup: C01 [X(C32H35N3O1)]
dipole: -4.5078397 -0.8849691 -4.5846239 debye
InChI: InChI=1/32C.3N.O.35H
charge 2 multiplicity 1
71 atoms
C  0.66013301 -2.13511789 -0.61781552
C  -0.46462312 -1.90525038 -1.4649771
C  -0.6146354 -0.63958118 -2.07491462
C  0.32809262 0.33729152 -1.83096354
C  1.43272192 0.08096733 -0.9832639
C  1.61693462 -1.14333205 -0.3687195
C  -0.59000044 -4.1048555 -0.58603366
C  -1.22898567 -3.10507167 -1.50230072
H  -1.44982404 -0.38985271 -2.71929051
H  0.22053502 1.31425102 -2.28544335
H  2.15563274 0.8716023 -0.81051984
H  2.45921648 -1.33606944 0.28130946
N  0.60799988 -3.41801293 -0.12290558
H  -0.30140966 -4.99583206 -1.14410885
C  1.46454176 -4.02666535 0.79048618
O  2.48258364 -3.48479283 1.18238426
C  0.96287727 -5.37978811 1.22348528
H  1.09515404 -6.08152298 0.39054742
H  1.59464196 -5.72371859 2.04213853
C  -0.51519256 -5.31257089 1.65193304
H  -0.56424461 -4.80754825 2.62148185
H  -0.87977661 -6.32931432 1.81023686
C  -1.44954203 -4.56536518 0.65489117
H  -2.1788133 -5.27279759 0.24380576
C  -2.18850884 -3.43989258 1.30136322
H  -1.72133304 -2.85443576 2.0999865
H  -3.17140459 -3.15094737 0.94098727
C  -2.39481011 -3.41765222 -2.19306504
H  -2.84842386 -4.39602589 -2.03927137
N  -3.03930354 -2.60919737 -3.0187961
H  -2.66583278 -1.68402604 -3.20158088
C  -2.97049397 -0.1344512 -5.13944336
C  -4.18847952 -0.54184634 -4.58689346
C  -4.94955093 0.37954771 -3.8588568
C  -4.4912346 1.68087232 -3.68106009
C  -3.26713828 2.07451453 -4.21682473
C  -2.50549205 1.16690469 -4.95043346
H  -2.37736686 -0.83325001 -5.72307746
H  -5.90307948 0.09745303 -3.42264035
H  -5.09327024 2.38685094 -3.11754145
H  -2.91175146 3.0895768 -4.07174414
H  -1.55834493 1.46774604 -5.3808284
C  -4.60147046 -1.98902502 -4.76385185
H  -3.97859664 -2.43142213 -5.54676738
C  -4.40509097 -2.85212609 -3.47351867
H  -4.46169509 -3.9047085 -3.76314491
C  -5.42220681 -2.61416463 -2.36517602
C  -6.55103237 -3.44116212 -2.30394766
C  -5.25615 -1.61838521 -1.39937707
C  -7.52314363 -3.24002065 -1.32291817
H  -6.66028583 -4.26560518 -2.99886179
C  -6.22021114 -1.42510928 -0.41780843
H  -4.36863651 -0.98881819 -1.4024856
C  -7.36096785 -2.22685926 -0.38312831
H  -8.39110809 -3.88800145 -1.28960105
H  -6.08170665 -0.64629828 0.32665391
H  -8.11232467 -2.07270118 0.38425455
C  -6.33373792 -1.15169017 -6.40652324
C  -6.37912253 -3.51638774 -5.77764778
C  -7.32652037 -1.90478225 -7.2714412
H  -5.39830954 -0.97043429 -6.93847323
H  -6.69260865 -0.21501349 -5.98640918
C  -6.77670028 -3.32865444 -7.23753557
H  -7.21543289 -3.86708496 -5.17380073
H  -5.5287592 -4.18081548 -5.63671735
H  -8.33165705 -1.85876906 -6.84169162
H  -7.36379556 -1.48274837 -8.27611277
H  -7.5053741 -4.08212478 -7.53866865
H  -5.90226296 -3.41827206 -7.8880448
N  -6.01448238 -2.11647691 -5.26993626
H  -6.64324733 -1.90380633 -4.48879997
