program: Gaussian 16
title: Title Card Required
version: ES64L-G16RevC.02
basis: 6-31+G(d,p)
method: UwB97XD
operation: Force
keyword: #p
keyword: uwb97xd/6-31+g(d,p)
keyword: force
keyword: scrf=(CPCM,solvent=chloroform)
keyword: nosymm
keyword: scf=qc
keyword: Guess=mix
title: #p uwb97xd/6-31+g(d,p) force scrf=(CPCM,solvent=chloroform) nosymm scf
basis: NPDir=0 NMtPBC= 1 NCelOv= 1 NCel= 1 NClECP= 1 NCelD= 1
basis: NCelK= 1 NCelE2= 1 NClLst= 1 CellRange= 0.0.
basis: One-electron integrals computed using PRISM.
basis: NBasis= 859 RedAO= T EigKep= 1.07D-06 NBF= 859
basis: NBsUse= 854 1.00D-06 EigRej= 5.68D-07 NBFU= 854
converged: NO NO NO NO
dipole: -40.0853 -22.5760 -34.2783
dipole: 57.3716
quadrupole: 23.9370 -95.2938 -25.8646
quadrupole: 97.7890 173.0340 66.9666
quadrupole: 56.3441 -62.8867 6.5425 97.7890 173.0340 66.9666
hfenergy: -1479.1789769 hartree
pointgroup: C01 [X(C32H35N3O1)]
dipole: -4.4761143 -0.8487518 -4.6468406 debye
InChI: InChI=1/32C.3N.O.35H
charge 2 multiplicity 1
71 atoms
C  0.67176016 -2.1281979 -0.61230321
C  -0.45021863 -1.90330819 -1.46678777
C  -0.60600035 -0.63278321 -2.0701557
C  0.33884955 0.3388622 -1.8350117
C  1.45093669 0.0809615 -1.00029731
C  1.63516807 -1.14207603 -0.37998508
C  -0.57465592 -4.10466252 -0.59245303
C  -1.2222917 -3.09069308 -1.49187277
H  -1.44684815 -0.38727222 -2.70898961
H  0.23144411 1.31532307 -2.29263423
H  2.17975119 0.86726489 -0.83823218
H  2.48332407 -1.33626542 0.26077113
N  0.60756343 -3.40540054 -0.10460064
H  -0.26543966 -4.97897688 -1.17054834
C  1.46367604 -4.01874341 0.80871467
O  2.47828718 -3.47941624 1.20458046
C  0.96151122 -5.37449186 1.23685027
H  1.11013806 -6.07634685 0.40708282
H  1.58168766 -5.71376978 2.06581918
C  -0.52205398 -5.3182734 1.64567695
H  -0.59377232 -4.80267559 2.60722775
H  -0.8798319 -6.33655872 1.8116507
C  -1.44989609 -4.59800555 0.623338
H  -2.15405434 -5.31790471 0.19938934
C  -2.20919292 -3.47586716 1.24768026
H  -1.70978915 -2.78358193 1.91375216
H  -3.23827041 -3.27447823 0.96867078
C  -2.41112328 -3.3955532 -2.15104408
H  -2.88273915 -4.35633341 -1.96652383
N  -3.04871609 -2.59663456 -2.99720744
H  -2.6626768 -1.6850586 -3.20499249
C  -2.96717323 -0.13444213 -5.13625079
C  -4.18620855 -0.5428662 -4.58294213
C  -4.9478942 0.3795691 -3.85664374
C  -4.4906266 1.68127435 -3.67930366
C  -3.26536678 2.07488765 -4.216991
C  -2.5050753 1.1670498 -4.94817666
H  -2.37458391 -0.8344534 -5.71913275
H  -5.90105559 0.09775902 -3.42021887
H  -5.09190507 2.38745519 -3.11776318
H  -2.91085552 3.09015019 -4.07237689
H  -1.55658215 1.46774413 -5.38017916
C  -4.59918332 -1.99006391 -4.757284
H  -3.97358474 -2.43500812 -5.53676385
C  -4.40894529 -2.849659 -3.4623773
H  -4.45761489 -3.90313304 -3.75118782
C  -5.43375356 -2.61465713 -2.36165971
C  -6.56042354 -3.4391498 -2.29875335
C  -5.26504552 -1.61572299 -1.39696947
C  -7.53054143 -3.24019373 -1.31853361
H  -6.67085785 -4.26677867 -2.99485597
C  -6.22968347 -1.42328871 -0.41244945
H  -4.37972558 -0.98849201 -1.40172017
C  -7.36887368 -2.2269568 -0.37735521
H  -8.39911657 -3.88875305 -1.28161512
H  -6.08828951 -0.64635974 0.33100802
H  -8.11806626 -2.07425875 0.39193814
C  -6.3307304 -1.15134736 -6.40339189
C  -6.3775665 -3.51687943 -5.77474515
C  -7.32548505 -1.90381046 -7.26734526
H  -5.39601901 -0.97023944 -6.9366513
H  -6.68962582 -0.21497796 -5.98187959
C  -6.77686674 -3.32847489 -7.2344036
H  -7.21459415 -3.86590718 -5.17088704
H  -5.52813881 -4.18281672 -5.63475383
H  -8.33081192 -1.85672358 -6.83773594
H  -7.36256275 -1.4814277 -8.27208178
H  -7.5066243 -4.08107171 -7.53548839
H  -5.9032911 -3.41773531 -7.88605944
N  -6.01112747 -2.1175455 -5.26676791
H  -6.6405086 -1.90447512 -4.48653091
