program: Gaussian 16
title: Title Card Required
version: ES64L-G16RevC.02
basis: 6-31+G(d,p)
method: UwB97XD
operation: Force
keyword: #p
keyword: uwb97xd/6-31+g(d,p)
keyword: force
keyword: scrf=(CPCM,solvent=chloroform)nosymm
keyword: scf=xqc
keyword: Guess=mix
title: #p uwb97xd/6-31+g(d,p) force scrf=(CPCM,solvent=chloroform) nosymm scf
basis: NPDir=0 NMtPBC= 1 NCelOv= 1 NCel= 1 NClECP= 1 NCelD= 1
basis: NCelK= 1 NCelE2= 1 NClLst= 1 CellRange= 0.0.
basis: One-electron integrals computed using PRISM.
basis: NBasis= 859 RedAO= T EigKep= 1.07D-06 NBF= 859
basis: NBsUse= 854 1.00D-06 EigRej= 5.68D-07 NBFU= 854
converged: NO NO NO NO
dipole: -40.1650 -22.5909 -34.3068
dipole: 57.4503
quadrupole: 23.9787 -95.2178 -25.5287
quadrupole: 97.9885 173.2475 67.0871
quadrupole: 56.2346 -62.9618 6.7272 97.9885 173.2475 67.0871
hfenergy: -1479.1790982 hartree
pointgroup: C01 [X(C32H35N3O1)]
dipole: -4.5073845 -0.853881 -4.6562456 debye
InChI: InChI=1/32C.3N.O.35H
charge 2 multiplicity 3
71 atoms
C  0.66938049 -2.13330778 -0.61485703
C  -0.45506974 -1.90336236 -1.46575161
C  -0.60899847 -0.6356154 -2.07244302
C  0.33635364 0.33754675 -1.83446569
C  1.44554022 0.07948439 -0.99653546
C  1.63185001 -1.14352732 -0.37836728
C  -0.58225373 -4.1072884 -0.58470175
C  -1.22930607 -3.0928082 -1.48748464
H  -1.44779569 -0.38793465 -2.7106741
H  0.22869621 1.31429719 -2.29136498
H  2.17199765 0.86745509 -0.82950629
H  2.4764753 -1.33745209 0.2651244
N  0.60753005 -3.40758728 -0.1058537
H  -0.27092161 -4.98136088 -1.17207933
C  1.46380716 -4.02108304 0.8051635
O  2.48114959 -3.48129757 1.19865156
C  0.9624645 -5.37622941 1.23309881
H  1.10643604 -6.07794678 0.40261481
H  1.58696782 -5.71772315 2.05942354
C  -0.51983755 -5.31732389 1.64704527
H  -0.58656578 -4.80356694 2.60990112
H  -0.87939474 -6.33443453 1.81053418
C  -1.44413473 -4.58796881 0.62559398
H  -2.16135744 -5.30561953 0.21288341
C  -2.20080738 -3.46032123 1.25334121
H  -1.71321024 -2.80076478 1.96598244
H  -3.22128403 -3.24162725 0.96070066
C  -2.40950439 -3.40085396 -2.15916093
H  -2.87366044 -4.36976693 -1.98854242
N  -3.04798637 -2.60115486 -3.00226441
H  -2.66319598 -1.68498424 -3.20263396
C  -2.9679605 -0.13437966 -5.13710548
C  -4.1869033 -0.54250817 -4.58383548
C  -4.94831226 0.37954404 -3.85716722
C  -4.49094968 1.68073039 -3.67968328
C  -3.26569345 2.07516281 -4.21689269
C  -2.50548933 1.1666448 -4.9487337
H  -2.37553162 -0.8341756 -5.72042607
H  -5.90166734 0.09772255 -3.42070601
H  -5.09231686 2.38727826 -3.11762981
H  -2.91125866 3.08969971 -4.07220661
H  -1.55705807 1.46778934 -5.38045531
C  -4.60003862 -1.98986453 -4.75921372
H  -3.97569821 -2.43380939 -5.53999542
C  -4.40773317 -2.8498109 -3.46540627
H  -4.45910363 -3.90391767 -3.75479778
C  -5.43038612 -2.61455947 -2.36253573
C  -6.55716347 -3.43953449 -2.30001833
C  -5.26196302 -1.61611196 -1.39712508
C  -7.528148 -3.24018114 -1.31957135
H  -6.66733038 -4.26618264 -2.99572363
C  -6.22666865 -1.42386867 -0.4136724
H  -4.37619586 -0.98815595 -1.40127639
C  -7.36596324 -2.22661937 -0.37870894
H  -8.39650432 -3.88820304 -1.28408839
H  -6.08616491 -0.64607603 0.33009793
H  -8.11617086 -2.07360272 0.38977629
C  -6.33174898 -1.15109773 -6.40401797
C  -6.37842158 -3.51656797 -5.77511684
C  -7.32625527 -1.9038268 -7.26802869
H  -5.39669003 -0.97027254 -6.93691429
H  -6.69059136 -0.21448354 -5.98307882
C  -6.77722837 -3.32850301 -7.23500496
H  -7.21519527 -3.8661435 -5.17156796
H  -5.52859991 -4.18205554 -5.63486298
H  -8.331129 -1.85732616 -6.83810523
H  -7.3635956 -1.48152378 -8.27275847
H  -7.50652011 -4.08115636 -7.53601883
H  -5.90332402 -3.4177541 -7.88630108
N  -6.01259663 -2.1168741 -5.26730392
H  -6.64155063 -1.90399271 -4.48691035
