program: Gaussian 16
title: Title Card Required
version: ES64L-G16RevC.02
basis: 6-31+G(d,p)
method: UwB97XD
operation: Force
keyword: #p
keyword: uwb97xd/6-31+g(d,p)
keyword: force
keyword: scrf=(CPCM,solvent=chloroform)
keyword: nosymm
keyword: scf=qc
keyword: Guess=mix
title: #p uwb97xd/6-31+g(d,p) force scrf=(CPCM,solvent=chloroform) nosymm scf
basis: NPDir=0 NMtPBC= 1 NCelOv= 1 NCel= 1 NClECP= 1 NCelD= 1
basis: NCelK= 1 NCelE2= 1 NClLst= 1 CellRange= 0.0.
basis: One-electron integrals computed using PRISM.
basis: NBasis= 859 RedAO= T EigKep= 1.07D-06 NBF= 859
basis: NBsUse= 854 1.00D-06 EigRej= 5.68D-07 NBFU= 854
converged: NO YES NO NO
dipole: -40.0354 -22.5983 -34.2228
dipole: 57.3125
quadrupole: 23.7303 -95.1514 -25.9030
quadrupole: 97.6313 172.9872 66.8183
quadrupole: 56.1717 -62.7101 6.5384 97.6313 172.9872 66.8183
hfenergy: -1479.1790768 hartree
pointgroup: C01 [X(C32H35N3O1)]
dipole: -4.4562853 -0.8573537 -4.6234436 debye
InChI: InChI=1/32C.3N.O.35H
charge 2 multiplicity 1
71 atoms
C  0.67031557 -2.13020763 -0.6133768
C  -0.4531298 -1.90206429 -1.4670467
C  -0.60685271 -0.63270607 -2.0710421
C  0.33716979 0.33933278 -1.83380326
C  1.44853883 0.08157605 -0.99701204
C  1.6321284 -1.14098102 -0.37727419
C  -0.58034008 -4.10408028 -0.58803912
C  -1.22223613 -3.0949748 -1.49655991
H  -1.44603251 -0.38611802 -2.71110485
H  0.23094049 1.3163382 -2.29140291
H  2.17722086 0.86787198 -0.83500147
H  2.47890693 -1.33477774 0.26481336
N  0.60905606 -3.40800995 -0.11083708
H  -0.27498224 -4.98819189 -1.16333995
C  1.46377 -4.02000249 0.8052263
O  2.47738843 -3.47896249 1.20117649
C  0.96177118 -5.37506085 1.23367719
H  1.10790604 -6.07794222 0.4047208
H  1.58434743 -5.71378618 2.06214581
C  -0.5203553 -5.31738005 1.64685968
H  -0.58799899 -4.80420587 2.60982577
H  -0.87914021 -6.33472815 1.81130245
C  -1.44904114 -4.58995509 0.62791311
H  -2.15777496 -5.31027296 0.20653784
C  -2.20881903 -3.47378343 1.25928066
H  -1.71245188 -2.7931702 1.94547151
H  -3.2299652 -3.25686945 0.96504701
C  -2.40595545 -3.40005945 -2.16102876
H  -2.87539567 -4.36370561 -1.98168073
N  -3.04782526 -2.59824845 -3.00251125
H  -2.66185032 -1.68527053 -3.20742132
C  -2.96768485 -0.13461916 -5.1367463
C  -4.18657937 -0.54245421 -4.58347736
C  -4.94825049 0.37932626 -3.85708567
C  -4.49063346 1.68142715 -3.679622
C  -3.26557536 2.07489504 -4.21712362
C  -2.50531767 1.16719707 -4.94837229
H  -2.37487261 -0.83424733 -5.71956455
H  -5.90125874 0.09779801 -3.42053188
H  -5.09204244 2.38745077 -3.11775495
H  -2.9108625 3.09003416 -4.07231746
H  -1.55666912 1.46773033 -5.38016761
C  -4.59976183 -1.9900914 -4.75811643
H  -3.97460265 -2.43472999 -5.53791382
C  -4.4079055 -2.84951253 -3.46365171
H  -4.45835616 -3.90349319 -3.7527323
C  -5.4318174 -2.61461663 -2.36170506
C  -6.55898953 -3.4394123 -2.29925874
C  -5.26402219 -1.61598551 -1.39676725
C  -7.52951731 -3.2401296 -1.31907474
H  -6.66949238 -4.26628732 -2.99527459
C  -6.22882481 -1.42336419 -0.41285533
H  -4.37859215 -0.98805373 -1.40125712
C  -7.36826979 -2.22710358 -0.37800271
H  -8.39820271 -3.8885733 -1.2829461
H  -6.08852668 -0.64613686 0.33059131
H  -8.11787698 -2.07436761 0.39091381
C  -6.33086849 -1.15141807 -6.40377566
C  -6.37759284 -3.5168938 -5.77504913
C  -7.32539186 -1.90398843 -7.26790944
H  -5.39578858 -0.97035961 -6.93655435
H  -6.68985705 -0.21495246 -5.98267732
C  -6.77661158 -3.32877187 -7.23490878
H  -7.21442405 -3.86636502 -5.17150506
H  -5.52772815 -4.18236263 -5.63487498
H  -8.33046114 -1.85712172 -6.8382648
H  -7.3624134 -1.48152906 -8.27259326
H  -7.50616208 -4.08132282 -7.53578765
H  -5.90288766 -3.41807801 -7.88641836
N  -6.01185044 -2.1173385 -5.26711607
H  -6.64122414 -1.9044737 -4.48699204
