program: Gaussian 16
title: Title Card Required
version: ES64L-G16RevC.02
basis: 6-31+G(d,p)
method: UwB97XD
operation: Force
keyword: #p
keyword: uwb97xd/6-31+g(d,p)
keyword: force
keyword: scrf=(CPCM,solvent=chloroform)nosymm
keyword: scf=xqc
keyword: Guess=mix
title: #p uwb97xd/6-31+g(d,p) force scrf=(CPCM,solvent=chloroform) nosymm scf
basis: NPDir=0 NMtPBC= 1 NCelOv= 1 NCel= 1 NClECP= 1 NCelD= 1
basis: NCelK= 1 NCelE2= 1 NClLst= 1 CellRange= 0.0.
basis: One-electron integrals computed using PRISM.
basis: NBasis= 859 RedAO= T EigKep= 1.08D-06 NBF= 859
basis: NBsUse= 854 1.00D-06 EigRej= 5.68D-07 NBFU= 854
converged: NO NO NO NO
dipole: -40.0727 -22.5792 -34.3015
dipole: 57.3780
quadrupole: 23.9301 -95.3243 -25.8041
quadrupole: 97.6702 173.2256 67.0349
quadrupole: 56.3295 -62.9249 6.5953 97.6702 173.2256 67.0349
hfenergy: -1479.1787859 hartree
pointgroup: C01 [X(C32H35N3O1)]
dipole: -4.4708584 -0.8500844 -4.6545176 debye
InChI: InChI=1/32C.3N.O.35H
charge 2 multiplicity 3
71 atoms
C  0.67033508 -2.12696955 -0.61178234
C  -0.4508922 -1.90057689 -1.46776229
C  -0.60659793 -0.63133352 -2.07113064
C  0.33874311 0.34052733 -1.83289128
C  1.45002498 0.08283898 -0.99748532
C  1.63293592 -1.13795682 -0.37526767
C  -0.57785768 -4.09926576 -0.59026751
C  -1.21514764 -3.09705805 -1.50568458
H  -1.44538428 -0.38631451 -2.71123327
H  0.2315692 1.3170308 -2.29078396
H  2.18151296 0.86840493 -0.83930785
H  2.48116659 -1.33364131 0.26447364
N  0.61116213 -3.40762219 -0.1162453
H  -0.27588191 -4.99075081 -1.15493146
C  1.4628359 -4.01956103 0.80528451
O  2.47511945 -3.47726889 1.20313922
C  0.96054368 -5.37342082 1.23461488
H  1.10906312 -6.0768407 0.40656726
H  1.58072049 -5.71129471 2.06476587
C  -0.52148319 -5.31798777 1.64710891
H  -0.58943028 -4.80332514 2.60934764
H  -0.88001529 -6.33596972 1.8116793
C  -1.45461311 -4.59286957 0.63109618
H  -2.15480689 -5.31529702 0.1999316
C  -2.21583387 -3.48851289 1.26889877
H  -1.71092802 -2.78717975 1.92617346
H  -3.23464592 -3.26686374 0.96803257
C  -2.40191099 -3.39882245 -2.16467391
H  -2.87806372 -4.35604765 -1.97160163
N  -3.04703438 -2.59742884 -3.00266579
H  -2.66160475 -1.68361654 -3.20990977
C  -2.96738417 -0.13465051 -5.13652088
C  -4.1862816 -0.54245175 -4.58336814
C  -4.94798852 0.37973817 -3.85727604
C  -4.49066564 1.6814097 -3.67938369
C  -3.26527871 2.07527091 -4.21704586
C  -2.5051997 1.16754209 -4.94800883
H  -2.37435502 -0.83443395 -5.71890211
H  -5.90084263 0.09762081 -3.42054399
H  -5.09177685 2.38769153 -3.11794086
H  -2.91057321 3.09023168 -4.07254499
H  -1.55655773 1.46750453 -5.3799818
C  -4.59952739 -1.99043225 -4.7573335
H  -3.97312877 -2.43524608 -5.535862
C  -4.40807177 -2.84899857 -3.46207461
H  -4.45759851 -3.90299489 -3.75095425
C  -5.43325385 -2.61457181 -2.36125034
C  -6.56095774 -3.43939703 -2.29929618
C  -5.26605519 -1.61592411 -1.39691763
C  -7.53158775 -3.24055646 -1.31885689
H  -6.67126817 -4.26660019 -2.99501176
C  -6.23070605 -1.42351084 -0.41306968
H  -4.38028577 -0.98857372 -1.40211124
C  -7.36979215 -2.22725265 -0.37778079
H  -8.39990723 -3.8894008 -1.28158898
H  -6.08950677 -0.6462371 0.33087471
H  -8.11905489 -2.07489205 0.39181005
C  -6.33014287 -1.15131292 -6.40384885
C  -6.37676343 -3.51702799 -5.77508847
C  -7.32463143 -1.90391364 -7.26826577
H  -5.39522392 -0.97123675 -6.93703655
H  -6.69000731 -0.21554889 -5.98158652
C  -6.77619993 -3.3289902 -7.23507271
H  -7.21353998 -3.86629809 -5.17135087
H  -5.52723645 -4.18299231 -5.63532828
H  -8.32977534 -1.85698453 -6.83869776
H  -7.36123349 -1.48174074 -8.2732858
H  -7.50564688 -4.08148264 -7.53589085
H  -5.90267877 -3.41824573 -7.88658195
N  -6.01089676 -2.11779763 -5.26703279
H  -6.64046729 -1.90500458 -4.48721676
