program: Gaussian 16
title: Title Card Required
version: ES64L-G16RevC.02
basis: 6-31+G(d,p)
method: UwB97XD
operation: Force
keyword: #p
keyword: uwb97xd/6-31+g(d,p)
keyword: force
keyword: scrf=(CPCM,solvent=chloroform)
keyword: nosymm
keyword: scf=qc
keyword: Guess=mix
title: #p uwb97xd/6-31+g(d,p) force scrf=(CPCM,solvent=chloroform) nosymm scf
basis: NPDir=0 NMtPBC= 1 NCelOv= 1 NCel= 1 NClECP= 1 NCelD= 1
basis: NCelK= 1 NCelE2= 1 NClLst= 1 CellRange= 0.0.
basis: One-electron integrals computed using PRISM.
basis: NBasis= 859 RedAO= T EigKep= 1.08D-06 NBF= 859
basis: NBsUse= 854 1.00D-06 EigRej= 5.67D-07 NBFU= 854
converged: NO NO NO NO
dipole: -39.9507 -22.5956 -34.1876
dipole: 57.2312
quadrupole: 23.5565 -95.2090 -26.2014
quadrupole: 97.3682 172.8489 66.7091
quadrupole: 56.1745 -62.5910 6.4165 97.3682 172.8489 66.7091
hfenergy: -1479.1789382 hartree
pointgroup: C01 [X(C32H35N3O1)]
dipole: -4.4228226 -0.8563402 -4.6106017 debye
InChI: InChI=1/32C.3N.O.35H
charge 2 multiplicity 1
71 atoms
C  0.67105765 -2.12726584 -0.61098542
C  -0.45083643 -1.90102203 -1.4682654
C  -0.60580741 -0.63171244 -2.07084465
C  0.33797416 0.33948226 -1.83364777
C  1.45113849 0.08203038 -0.99800938
C  1.63386942 -1.13882161 -0.3759488
C  -0.57753336 -4.09998566 -0.59081609
C  -1.21602794 -3.0964773 -1.5053866
H  -1.44626597 -0.38645022 -2.71026643
H  0.23140118 1.31626134 -2.29153799
H  2.181632 0.86738357 -0.83967561
H  2.4829061 -1.33451729 0.26289976
N  0.61064982 -3.40640985 -0.11223402
H  -0.27044635 -4.98549857 -1.16144515
C  1.46334675 -4.01871913 0.80723052
O  2.47582924 -3.47790353 1.20426451
C  0.96067678 -5.37351382 1.23582563
H  1.10966081 -6.07641222 0.40751516
H  1.58060443 -5.71199065 2.06618068
C  -0.52200102 -5.31781272 1.64637629
H  -0.59194503 -4.80286075 2.60801503
H  -0.88026624 -6.33546693 1.81149856
C  -1.45328587 -4.59409432 0.6281227
H  -2.1537919 -5.31706433 0.19837701
C  -2.2174092 -3.49008023 1.26767289
H  -1.70978228 -2.7827609 1.91670956
H  -3.23696577 -3.27131942 0.96847165
C  -2.40260089 -3.39727377 -2.16006571
H  -2.88075766 -4.35478387 -1.96682589
N  -3.04857716 -2.59588587 -3.00087477
H  -2.66230286 -1.68410067 -3.20857584
C  -2.96736944 -0.1342771 -5.13608923
C  -4.18593018 -0.54276716 -4.58334948
C  -4.94806834 0.37992107 -3.85678723
C  -4.49032586 1.68104902 -3.67960594
C  -3.26545967 2.07546173 -4.21677051
C  -2.50487651 1.16684775 -4.94826254
H  -2.37432363 -0.83461677 -5.71886327
H  -5.90087913 0.09788807 -3.42037766
H  -5.09187944 2.38770715 -3.11789993
H  -2.91079899 3.09014723 -4.07250242
H  -1.55644147 1.46767641 -5.38004224
C  -4.59913102 -1.9902964 -4.757126
H  -3.97272384 -2.43514431 -5.5359397
C  -4.40834902 -2.84900251 -3.46182786
H  -4.45736843 -3.90287177 -3.75079196
C  -5.4341031 -2.61464183 -2.3615755
C  -6.56117043 -3.43935008 -2.2991368
C  -5.26620398 -1.61584497 -1.39702744
C  -7.53149034 -3.24051371 -1.31862421
H  -6.67157403 -4.26681486 -2.99487101
C  -6.23076082 -1.42334685 -0.4126819
H  -4.3805306 -0.98872384 -1.40210378
C  -7.36985201 -2.22727618 -0.37752128
H  -8.39988941 -3.88939623 -1.28160229
H  -6.08941547 -0.64633585 0.33083031
H  -8.11901979 -2.07473698 0.39193709
C  -6.3301926 -1.15146655 -6.40364715
C  -6.37688154 -3.51719936 -5.77502844
C  -7.32482703 -1.90396325 -7.26797782
H  -5.39542261 -0.9706587 -6.93703498
H  -6.68945097 -0.21537613 -5.98172392
C  -6.77632205 -3.3289244 -7.23482783
H  -7.21360529 -3.8663946 -5.17121884
H  -5.52735825 -4.18325524 -5.63523129
H  -8.33009397 -1.85692223 -6.83880774
H  -7.36121653 -1.48185874 -8.27293934
H  -7.50591008 -4.08130444 -7.53595145
H  -5.90271144 -3.41808795 -7.88638951
N  -6.01072269 -2.11785576 -5.26715117
H  -6.6399443 -1.9051159 -4.48694334
